BDBM50448846 CHEMBL3125239
SMILES: CCc1cc(C(=O)N[C@@H]2C[C@H](N(C2)C(=O)c2coc3ccccc23)C(=O)NCc2ccccc2)n(C)n1
InChI Key: InChIKey=WPSGVINAQWNYOL-YKSBVNFPSA-N
Data: 1 IC50
Activity Spreadsheet -- Enzyme Inhibition Constant Data from BindingDB
Found 1 hit for monomerid = 50448846
Trg + Lig
Ki
nM
ΔG°
kcal/mole
IC50
nM
Kd
nM
EC50/IC50
nM
koff
s-1
kon
M-1s-1
pHTemp
°C
Enoyl-ACP Reductase (InhA)
(Mycobacterium tuberculosis (strain ATCC 25618 / H3...)
BDBM50448846
(CHEMBL3125239)
Show SMILES CCc1cc(C(=O)N[C@@H]2C[C@H](N(C2)C(=O)c2coc3ccccc23)C(=O)NCc2ccccc2)n(C)n1 |r|
Show InChI InChI=1S/C28H29N5O4/c1-3-19-13-23(32(2)31-19)27(35)30-20-14-24(26(34)29-15-18-9-5-4-6-10-18)33(16-20)28(36)22-17-37-25-12-8-7-11-21(22)25/h4-13,17,20,24H,3,14-16H2,1-2H3,(H,29,34)(H,30,35)/t20-,24+/m1/s1
n/an/a 41n/an/an/an/an/an/a
GlaxoSmithKline
Curated by ChEMBL
Assay Description
Inhibition of Mycobacterium tuberculosis full length biotinylated InhA (270 amino acids) using DDCoA as substrate assessed as NADH oxidation by fluor...
J Med Chem 57: 1276-88 (2014)
Article DOI: 10.1021/jm401326j
BindingDB Entry DOI: 10.7270/Q2NP25XB