BDBM50448857 CHEMBL3125279
SMILES: CCc1cc(C(=O)N[C@@H]2C[C@H](N(C2)C(=O)c2coc3ccccc23)C(N)=O)n(C)n1
InChI Key: InChIKey=KWJSINZBDWZDQS-CJNGLKHVSA-N
Data: 1 IC50
Activity Spreadsheet -- Enzyme Inhibition Constant Data from BindingDB
Found 1 hit for monomerid = 50448857
Trg + Lig
Ki
nM
ΔG°
kcal/mole
IC50
nM
Kd
nM
EC50/IC50
nM
koff
s-1
kon
M-1s-1
pHTemp
°C
Enoyl-ACP Reductase (InhA)
(Mycobacterium tuberculosis (strain ATCC 25618 / H3...)
BDBM50448857
(CHEMBL3125279)
Show SMILES CCc1cc(C(=O)N[C@@H]2C[C@H](N(C2)C(=O)c2coc3ccccc23)C(N)=O)n(C)n1 |r|
Show InChI InChI=1S/C21H23N5O4/c1-3-12-8-17(25(2)24-12)20(28)23-13-9-16(19(22)27)26(10-13)21(29)15-11-30-18-7-5-4-6-14(15)18/h4-8,11,13,16H,3,9-10H2,1-2H3,(H2,22,27)(H,23,28)/t13-,16+/m1/s1
n/an/a 12n/an/an/an/an/an/a
GlaxoSmithKline
Curated by ChEMBL
Assay Description
Inhibition of Mycobacterium tuberculosis full length biotinylated InhA (270 amino acids) using DDCoA as substrate assessed as NADH oxidation by fluor...
J Med Chem 57: 1276-88 (2014)
Article DOI: 10.1021/jm401326j
BindingDB Entry DOI: 10.7270/Q2NP25XB