BDBM50448860 CHEMBL3125274
SMILES: CCc1cc(C(=O)N[C@@H]2C[C@H](N(C2)C(=O)c2coc3ccccc23)C(=O)OC)n(C)n1
InChI Key: InChIKey=FJQNJOUUZJZMOP-KDOFPFPSSA-N
Data: 1 IC50
Activity Spreadsheet -- Enzyme Inhibition Constant Data from BindingDB
Found 1 hit for monomerid = 50448860
Trg + Lig
Ki
nM
ΔG°
kcal/mole
IC50
nM
Kd
nM
EC50/IC50
nM
koff
s-1
kon
M-1s-1
pHTemp
°C
Enoyl-ACP Reductase (InhA)
(Mycobacterium tuberculosis (strain ATCC 25618 / H3...)
BDBM50448860
(CHEMBL3125274)
Show SMILES CCc1cc(C(=O)N[C@@H]2C[C@H](N(C2)C(=O)c2coc3ccccc23)C(=O)OC)n(C)n1 |r|
Show InChI InChI=1S/C22H24N4O5/c1-4-13-9-17(25(2)24-13)20(27)23-14-10-18(22(29)30-3)26(11-14)21(28)16-12-31-19-8-6-5-7-15(16)19/h5-9,12,14,18H,4,10-11H2,1-3H3,(H,23,27)/t14-,18+/m1/s1
n/an/a 215n/an/an/an/an/an/a
GlaxoSmithKline
Curated by ChEMBL
Assay Description
Inhibition of Mycobacterium tuberculosis full length biotinylated InhA (270 amino acids) using DDCoA as substrate assessed as NADH oxidation by fluor...
J Med Chem 57: 1276-88 (2014)
Article DOI: 10.1021/jm401326j
BindingDB Entry DOI: 10.7270/Q2NP25XB