BDBM50448885 CHEMBL3125256
SMILES: CCc1cc(C(=O)N[C@@H]2C[C@H](N(C2)C(=O)c2coc3ccccc23)C(=O)Nc2ccn(Cc3c(F)cccc3F)n2)n(C)n1
InChI Key: InChIKey=OOVRABCBUGVZEC-BCHFMIIMSA-N
Data: 1 IC50
Activity Spreadsheet -- Enzyme Inhibition Constant Data from BindingDB
Found 1 hit for monomerid = 50448885
Trg + Lig
Ki
nM
ΔG°
kcal/mole
IC50
nM
Kd
nM
EC50/IC50
nM
koff
s-1
kon
M-1s-1
pHTemp
°C
Enoyl-[acyl-carrier-protein] reductase [NADH]
(Mycobacterium tuberculosis (strain ATCC 25618 / H3...)
BDBM50448885
(CHEMBL3125256)
Show SMILES CCc1cc(C(=O)N[C@@H]2C[C@H](N(C2)C(=O)c2coc3ccccc23)C(=O)Nc2ccn(Cc3c(F)cccc3F)n2)n(C)n1 |r|
Show InChI InChI=1S/C31H29F2N7O4/c1-3-18-13-25(38(2)36-18)29(41)34-19-14-26(40(15-19)31(43)22-17-44-27-10-5-4-7-20(22)27)30(42)35-28-11-12-39(37-28)16-21-23(32)8-6-9-24(21)33/h4-13,17,19,26H,3,14-16H2,1-2H3,(H,34,41)(H,35,37,42)/t19-,26+/m1/s1
n/an/a 4n/an/an/an/an/an/a
GlaxoSmithKline
Curated by ChEMBL
Assay Description
Inhibition of Mycobacterium tuberculosis full length biotinylated InhA (270 amino acids) using DDCoA as substrate assessed as NADH oxidation by fluor...
J Med Chem 57: 1276-88 (2014)
Article DOI: 10.1021/jm401326j
BindingDB Entry DOI: 10.7270/Q2NP25XB