BDBM50448888 CHEMBL3125253
SMILES: CCc1cc(C(=O)N[C@@H]2C[C@H](N(C2)C(=O)c2coc3ccccc23)C(=O)Nc2cnn(CC)n2)n(C)n1
InChI Key: InChIKey=IOIAXKAEWSTFLC-UZLBHIALSA-N
Data: 1 IC50
Activity Spreadsheet -- Enzyme Inhibition Constant Data from BindingDB
Found 1 hit for monomerid = 50448888
Trg + Lig
Ki
nM
ΔG°
kcal/mole
IC50
nM
Kd
nM
EC50/IC50
nM
koff
s-1
kon
M-1s-1
pHTemp
°C
Enoyl-ACP Reductase (InhA)
(Mycobacterium tuberculosis (strain ATCC 25618 / H3...)
BDBM50448888
(CHEMBL3125253)
Show SMILES CCc1cc(C(=O)N[C@@H]2C[C@H](N(C2)C(=O)c2coc3ccccc23)C(=O)Nc2cnn(CC)n2)n(C)n1 |r|
Show InChI InChI=1S/C25H28N8O4/c1-4-15-10-19(31(3)29-15)23(34)27-16-11-20(24(35)28-22-12-26-33(5-2)30-22)32(13-16)25(36)18-14-37-21-9-7-6-8-17(18)21/h6-10,12,14,16,20H,4-5,11,13H2,1-3H3,(H,27,34)(H,28,30,35)/t16-,20+/m1/s1
n/an/a 3n/an/an/an/an/an/a
GlaxoSmithKline
Curated by ChEMBL
Assay Description
Inhibition of Mycobacterium tuberculosis full length biotinylated InhA (270 amino acids) using DDCoA as substrate assessed as NADH oxidation by fluor...
J Med Chem 57: 1276-88 (2014)
Article DOI: 10.1021/jm401326j
BindingDB Entry DOI: 10.7270/Q2NP25XB