BDBM50448941 CHEMBL3125522::US9296736, 301::US9593129, Example 301
SMILES: CC[C@@H](CS(C)(=O)=O)N1[C@@H]([C@H](C[C@](C)(CC(O)=O)C1=O)c1cccc(Cl)c1)c1ccc(Cl)cc1
InChI Key: InChIKey=XQBLZSNCUVVCBF-KWLZBDKBSA-N
Data: 4 IC50
Activity Spreadsheet -- Enzyme Inhibition Constant Data from BindingDB
Found 4 hits for monomerid = 50448941
Trg + Lig
Ki
nM
ΔG°
kcal/mole
IC50
nM
Kd
nM
EC50/IC50
nM
koff
s-1
kon
M-1s-1
pHTemp
°C
MDM2 and p53
(Homo sapiens (Human))
BDBM50448941
(CHEMBL3125522 | US9296736, 301 | US9593129, Exampl...)
Show SMILES CC[C@@H](CS(C)(=O)=O)N1[C@@H]([C@H](C[C@](C)(CC(O)=O)C1=O)c1cccc(Cl)c1)c1ccc(Cl)cc1 |r|
Show InChI InChI=1S/C25H29Cl2NO5S/c1-4-20(15-34(3,32)33)28-23(16-8-10-18(26)11-9-16)21(17-6-5-7-19(27)12-17)13-25(2,24(28)31)14-22(29)30/h5-12,20-21,23H,4,13-15H2,1-3H3,(H,29,30)/t20-,21+,23+,25+/m0/s1
US Patent
n/an/a 0.300n/an/an/an/a7.425
Amgen INC.
US Patent
Assay Description
The standard assay conditions for the in vitro HTRF assay consisted of a 50 ul total reaction volume in black 384-well Costar polypropylene plates in...
US Patent US9296736 (2016)
BindingDB Entry DOI: 10.7270/Q29022M2
E3 ubiquitin-protein ligase Mdm2 (aa 1-188)
(Homo sapiens (Human))
BDBM50448941
(CHEMBL3125522 | US9296736, 301 | US9593129, Exampl...)
Show SMILES CC[C@@H](CS(C)(=O)=O)N1[C@@H]([C@H](C[C@](C)(CC(O)=O)C1=O)c1cccc(Cl)c1)c1ccc(Cl)cc1 |r|
Show InChI InChI=1S/C25H29Cl2NO5S/c1-4-20(15-34(3,32)33)28-23(16-8-10-18(26)11-9-16)21(17-6-5-7-19(27)12-17)13-25(2,24(28)31)14-22(29)30/h5-12,20-21,23H,4,13-15H2,1-3H3,(H,29,30)/t20-,21+,23+,25+/m0/s1
US Patent
n/an/a 0.300n/an/an/an/an/an/a
Amgen, Inc.
US Patent
Assay Description
The standard assay conditions for the in vitro HTRF assay consisted of a 50 ul total reaction volume in black 384-well Costar polypropylene plates in...
US Patent US9593129 (2017)
BindingDB Entry DOI: 10.7270/Q20P1232
E3 ubiquitin-protein ligase Mdm2
(Homo sapiens (Human))
BDBM50448941
(CHEMBL3125522 | US9296736, 301 | US9593129, Exampl...)
Show SMILES CC[C@@H](CS(C)(=O)=O)N1[C@@H]([C@H](C[C@](C)(CC(O)=O)C1=O)c1cccc(Cl)c1)c1ccc(Cl)cc1 |r|
Show InChI InChI=1S/C25H29Cl2NO5S/c1-4-20(15-34(3,32)33)28-23(16-8-10-18(26)11-9-16)21(17-6-5-7-19(27)12-17)13-25(2,24(28)31)14-22(29)30/h5-12,20-21,23H,4,13-15H2,1-3H3,(H,29,30)/t20-,21+,23+,25+/m0/s1
NCI pathway
Reactome pathway
n/an/a 0.300n/an/an/an/an/an/a
Amgen Inc.
Curated by ChEMBL
Assay Description
Binding affinity to human GST-thrombin-tagged MDM2 assessed as inhibition of interaction with human p53 after 1 hr by HTRF assay
J Med Chem 57: 1454-72 (2014)
Article DOI: 10.1021/jm401753e
BindingDB Entry DOI: 10.7270/Q24M960Z
E3 ubiquitin-protein ligase Mdm2
(Homo sapiens (Human))
BDBM50448941
(CHEMBL3125522 | US9296736, 301 | US9593129, Exampl...)
Show SMILES CC[C@@H](CS(C)(=O)=O)N1[C@@H]([C@H](C[C@](C)(CC(O)=O)C1=O)c1cccc(Cl)c1)c1ccc(Cl)cc1 |r|
Show InChI InChI=1S/C25H29Cl2NO5S/c1-4-20(15-34(3,32)33)28-23(16-8-10-18(26)11-9-16)21(17-6-5-7-19(27)12-17)13-25(2,24(28)31)14-22(29)30/h5-12,20-21,23H,4,13-15H2,1-3H3,(H,29,30)/t20-,21+,23+,25+/m0/s1
NCI pathway
Reactome pathway
n/an/a 1.60n/an/an/an/an/an/a
Amgen Inc.
Curated by ChEMBL
Assay Description
Binding affinity to human GST-thrombin-tagged MDM2 assessed as inhibition of interaction with human p53 after 1 hr by HTRF assay in presence of 15% h...
J Med Chem 57: 1454-72 (2014)
Article DOI: 10.1021/jm401753e
BindingDB Entry DOI: 10.7270/Q24M960Z