BDBM50448951 CHEMBL3125706
SMILES: CC[C@@H](C[C@@H](C)O)N1[C@@H]([C@H](C[C@](C)(CC(O)=O)C1=O)c1cccc(Cl)c1)c1ccc(Cl)cc1
InChI Key: InChIKey=LWEGKSSGTVFZQX-UADZOMQLSA-N
Data: 2 IC50
Activity Spreadsheet -- Enzyme Inhibition Constant Data from BindingDB
Found 2 hits for monomerid = 50448951
Trg + Lig
Ki
nM
ΔG°
kcal/mole
IC50
nM
Kd
nM
EC50/IC50
nM
koff
s-1
kon
M-1s-1
pHTemp
°C
E3 ubiquitin-protein ligase Mdm2
(Homo sapiens (Human))
BDBM50448951
(CHEMBL3125706)
Show SMILES CC[C@@H](C[C@@H](C)O)N1[C@@H]([C@H](C[C@](C)(CC(O)=O)C1=O)c1cccc(Cl)c1)c1ccc(Cl)cc1 |r|
Show InChI InChI=1S/C26H31Cl2NO4/c1-4-21(12-16(2)30)29-24(17-8-10-19(27)11-9-17)22(18-6-5-7-20(28)13-18)14-26(3,25(29)33)15-23(31)32/h5-11,13,16,21-22,24,30H,4,12,14-15H2,1-3H3,(H,31,32)/t16-,21+,22-,24-,26-/m1/s1
NCI pathway
Reactome pathway
n/an/a 0.400n/an/an/an/an/an/a
Amgen Inc.
Curated by ChEMBL
Assay Description
Binding affinity to human GST-thrombin-tagged MDM2 assessed as inhibition of interaction with human p53 after 1 hr by HTRF assay
J Med Chem 57: 1454-72 (2014)
Article DOI: 10.1021/jm401753e
BindingDB Entry DOI: 10.7270/Q24M960Z
E3 ubiquitin-protein ligase Mdm2
(Homo sapiens (Human))
BDBM50448951
(CHEMBL3125706)
Show SMILES CC[C@@H](C[C@@H](C)O)N1[C@@H]([C@H](C[C@](C)(CC(O)=O)C1=O)c1cccc(Cl)c1)c1ccc(Cl)cc1 |r|
Show InChI InChI=1S/C26H31Cl2NO4/c1-4-21(12-16(2)30)29-24(17-8-10-19(27)11-9-17)22(18-6-5-7-20(28)13-18)14-26(3,25(29)33)15-23(31)32/h5-11,13,16,21-22,24,30H,4,12,14-15H2,1-3H3,(H,31,32)/t16-,21+,22-,24-,26-/m1/s1
NCI pathway
Reactome pathway
n/an/a 5.60n/an/an/an/an/an/a
Amgen Inc.
Curated by ChEMBL
Assay Description
Binding affinity to human GST-thrombin-tagged MDM2 assessed as inhibition of interaction with human p53 after 1 hr by HTRF assay in presence of 15% h...
J Med Chem 57: 1454-72 (2014)
Article DOI: 10.1021/jm401753e
BindingDB Entry DOI: 10.7270/Q24M960Z