BDBM50449038 CHEMBL3126204::US9212144, 15 (Ex. 17)
SMILES: Nc1ccc2ccc(CCNCCc3cccc(Cl)c3)cc2n1
InChI Key: InChIKey=LTZZOZXCYRCKFV-UHFFFAOYSA-N
Data: 47 KI
PDB links: 1 PDB ID matches this monomer.
Activity Spreadsheet -- Enzyme Inhibition Constant Data from BindingDB
Found 47 hits for monomerid = 50449038
Trg + Lig
Ki
nM
ΔG°
kcal/mole
IC50
nM
Kd
nM
EC50/IC50
nM
koff
s-1
kon
M-1s-1
pHTemp
°C
Nitric-oxide synthase, brain
(Rattus norvegicus (rat))
BDBM50449038
(CHEMBL3126204 | US9212144, 15 (Ex. 17))
Show SMILES Nc1ccc2ccc(CCNCCc3cccc(Cl)c3)cc2n1
Show InChI InChI=1S/C19H20ClN3/c20-17-3-1-2-14(12-17)8-10-22-11-9-15-4-5-16-6-7-19(21)23-18(16)13-15/h1-7,12-13,22H,8-11H2,(H2,21,23)
US Patent
66n/an/an/an/an/an/a7.4n/a
Northwestern University
US Patent
Assay Description
To test for enzyme inhibition, the hemoglobin capture assay was used to measure nitric oxide production. The assay was performed at 37° C. in HEPES b...
US Patent US9212144 (2015)
BindingDB Entry DOI: 10.7270/Q2K0732P
3D
3D Structure (crystal)
Nitric-oxide synthase, brain
(Rattus norvegicus (rat))
BDBM50449038
(CHEMBL3126204 | US9212144, 15 (Ex. 17))
Show SMILES Nc1ccc2ccc(CCNCCc3cccc(Cl)c3)cc2n1
Show InChI InChI=1S/C19H20ClN3/c20-17-3-1-2-14(12-17)8-10-22-11-9-15-4-5-16-6-7-19(21)23-18(16)13-15/h1-7,12-13,22H,8-11H2,(H2,21,23)
66n/an/an/an/an/an/an/an/a
Northwestern University
Curated by ChEMBL
Assay Description
Inhibition of rat nNOS expressed in Escherichia coli expression system assessed as reduction in NO production in presence of L-arginine measured for ...
J Med Chem 63: 4528-4554 (2020)
Article DOI: 10.1021/acs.jmedchem.9b01573
3D
3D Structure (crystal)
Nitric-oxide synthase, brain
(Rattus norvegicus (rat))
BDBM50449038
(CHEMBL3126204 | US9212144, 15 (Ex. 17))
Show SMILES Nc1ccc2ccc(CCNCCc3cccc(Cl)c3)cc2n1
Show InChI InChI=1S/C19H20ClN3/c20-17-3-1-2-14(12-17)8-10-22-11-9-15-4-5-16-6-7-19(21)23-18(16)13-15/h1-7,12-13,22H,8-11H2,(H2,21,23)
66n/an/an/an/an/an/an/an/a
Northwestern University
Curated by ChEMBL
Assay Description
Inhibition of wild type recombinant rat nNOS expressed in Escherichia coli assessed as nitric oxide production by hemoglobin capture assay
J Med Chem 58: 8694-712 (2015)
Article DOI: 10.1021/acs.jmedchem.5b01330
BindingDB Entry DOI: 10.7270/Q2R214C3
3D
3D Structure (crystal)
Nitric-oxide synthase, brain
(Rattus norvegicus (rat))
BDBM50449038
(CHEMBL3126204 | US9212144, 15 (Ex. 17))
Show SMILES Nc1ccc2ccc(CCNCCc3cccc(Cl)c3)cc2n1
Show InChI InChI=1S/C19H20ClN3/c20-17-3-1-2-14(12-17)8-10-22-11-9-15-4-5-16-6-7-19(21)23-18(16)13-15/h1-7,12-13,22H,8-11H2,(H2,21,23)
66n/an/an/an/an/an/an/an/a
Department of Chemistry, Department of Molecular Biosciences, Chemistry of Life Processes Institute, Center for Molecular Innovation and Drug Discovery, Northwestern University , Evanston, Illinois 6
Curated by ChEMBL
Assay Description
Inhibition of recombinant rat nNOS expressed in Escherichia coli using L-arginine as substrate after 30 secs by hemoglobin capture assay
J Med Chem 60: 7146-7165 (2017)
Article DOI: 10.1021/acs.jmedchem.7b00835
BindingDB Entry DOI: 10.7270/Q2639S64
3D
3D Structure (crystal)
Nitric-oxide synthase, brain
(Rattus norvegicus (rat))
BDBM50449038
(CHEMBL3126204 | US9212144, 15 (Ex. 17))
Show SMILES Nc1ccc2ccc(CCNCCc3cccc(Cl)c3)cc2n1
Show InChI InChI=1S/C19H20ClN3/c20-17-3-1-2-14(12-17)8-10-22-11-9-15-4-5-16-6-7-19(21)23-18(16)13-15/h1-7,12-13,22H,8-11H2,(H2,21,23)
66n/an/an/an/an/an/an/an/a
Northwestern University
Curated by ChEMBL
Assay Description
Inhibition of recombinant rat nNOS expressed in Escherichia coli assessed as reduction in nitric oxide production using L-arginine as substrate measu...
J Med Chem 60: 3958-3978 (2017)
Article DOI: 10.1021/acs.jmedchem.7b00259
BindingDB Entry DOI: 10.7270/Q2RV0R5D
3D
3D Structure (crystal)
Nitric-oxide synthase, brain
(Rattus norvegicus (rat))
BDBM50449038
(CHEMBL3126204 | US9212144, 15 (Ex. 17))
Show SMILES Nc1ccc2ccc(CCNCCc3cccc(Cl)c3)cc2n1
Show InChI InChI=1S/C19H20ClN3/c20-17-3-1-2-14(12-17)8-10-22-11-9-15-4-5-16-6-7-19(21)23-18(16)13-15/h1-7,12-13,22H,8-11H2,(H2,21,23)
66n/an/an/an/an/an/an/an/a
Northwestern University
Curated by ChEMBL
Assay Description
Inhibition of rat recombinant nNOS expressed in Escherichia coli using L-arginine as substrate assessed as NO production by hemoglobin capture assay
J Med Chem 57: 1513-30 (2014)
Article DOI: 10.1021/jm401838x
BindingDB Entry DOI: 10.7270/Q2MP54SZ
3D
3D Structure (crystal)
Mu-type opioid receptor
(Homo sapiens (Human))
BDBM50449038
(CHEMBL3126204 | US9212144, 15 (Ex. 17))
Show SMILES Nc1ccc2ccc(CCNCCc3cccc(Cl)c3)cc2n1
Show InChI InChI=1S/C19H20ClN3/c20-17-3-1-2-14(12-17)8-10-22-11-9-15-4-5-16-6-7-19(21)23-18(16)13-15/h1-7,12-13,22H,8-11H2,(H2,21,23)
NCI pathway
Reactome pathway
<100n/an/an/an/an/an/an/an/a
Department of Chemistry, Department of Molecular Biosciences, Chemistry of Life Processes Institute, Center for Molecular Innovation and Drug Discovery, Northwestern University , Evanston, Illinois 6
Curated by ChEMBL
Assay Description
Displacement of [3H]DAMGO from human mu opioid receptor expressed in HEK cells after 90 mins by scintillation counting method
J Med Chem 60: 7146-7165 (2017)
Article DOI: 10.1021/acs.jmedchem.7b00835
BindingDB Entry DOI: 10.7270/Q2639S64
Histamine H2 receptor
(Homo sapiens (Human))
BDBM50449038
(CHEMBL3126204 | US9212144, 15 (Ex. 17))
Show SMILES Nc1ccc2ccc(CCNCCc3cccc(Cl)c3)cc2n1
Show InChI InChI=1S/C19H20ClN3/c20-17-3-1-2-14(12-17)8-10-22-11-9-15-4-5-16-6-7-19(21)23-18(16)13-15/h1-7,12-13,22H,8-11H2,(H2,21,23)
Reactome pathway
<100n/an/an/an/an/an/an/an/a
Department of Chemistry, Department of Molecular Biosciences, Chemistry of Life Processes Institute, Center for Molecular Innovation and Drug Discovery, Northwestern University , Evanston, Illinois 6
Curated by ChEMBL
Assay Description
Displacement of [3H]Tiotidine from human H2 receptor expressed in HEK cells after 90 mins by scintillation counting method
J Med Chem 60: 7146-7165 (2017)
Article DOI: 10.1021/acs.jmedchem.7b00835
BindingDB Entry DOI: 10.7270/Q2639S64
5-hydroxytryptamine receptor 1A
(Homo sapiens (Human))
BDBM50449038
(CHEMBL3126204 | US9212144, 15 (Ex. 17))
Show SMILES Nc1ccc2ccc(CCNCCc3cccc(Cl)c3)cc2n1
Show InChI InChI=1S/C19H20ClN3/c20-17-3-1-2-14(12-17)8-10-22-11-9-15-4-5-16-6-7-19(21)23-18(16)13-15/h1-7,12-13,22H,8-11H2,(H2,21,23)
<100n/an/an/an/an/an/an/an/a
Department of Chemistry, Department of Molecular Biosciences, Chemistry of Life Processes Institute, Center for Molecular Innovation and Drug Discovery, Northwestern University , Evanston, Illinois 6
Curated by ChEMBL
Assay Description
Displacement of [3H]Way100635 from human 5-HT1A receptor expressed in CHO cells after 90 mins by scintillation counting method
J Med Chem 60: 7146-7165 (2017)
Article DOI: 10.1021/acs.jmedchem.7b00835
BindingDB Entry DOI: 10.7270/Q2639S64
Serotonin (5-HT) receptor
(Homo sapiens (Human))
BDBM50449038
(CHEMBL3126204 | US9212144, 15 (Ex. 17))
Show SMILES Nc1ccc2ccc(CCNCCc3cccc(Cl)c3)cc2n1
Show InChI InChI=1S/C19H20ClN3/c20-17-3-1-2-14(12-17)8-10-22-11-9-15-4-5-16-6-7-19(21)23-18(16)13-15/h1-7,12-13,22H,8-11H2,(H2,21,23)
Reactome pathway
<100n/an/an/an/an/an/an/an/a
Department of Chemistry, Department of Molecular Biosciences, Chemistry of Life Processes Institute, Center for Molecular Innovation and Drug Discovery, Northwestern University , Evanston, Illinois 6
Curated by ChEMBL
Assay Description
Displacement of [3H]5-HT from human 5-HT1E receptor expressed in HEK cells after 90 mins by scintillation counting method
J Med Chem 60: 7146-7165 (2017)
Article DOI: 10.1021/acs.jmedchem.7b00835
BindingDB Entry DOI: 10.7270/Q2639S64
5-hydroxytryptamine receptor 2C
(Homo sapiens (Human))
BDBM50449038
(CHEMBL3126204 | US9212144, 15 (Ex. 17))
Show SMILES Nc1ccc2ccc(CCNCCc3cccc(Cl)c3)cc2n1
Show InChI InChI=1S/C19H20ClN3/c20-17-3-1-2-14(12-17)8-10-22-11-9-15-4-5-16-6-7-19(21)23-18(16)13-15/h1-7,12-13,22H,8-11H2,(H2,21,23)
Reactome pathway
<100n/an/an/an/an/an/an/an/a
Department of Chemistry, Department of Molecular Biosciences, Chemistry of Life Processes Institute, Center for Molecular Innovation and Drug Discovery, Northwestern University , Evanston, Illinois 6
Curated by ChEMBL
Assay Description
Displacement of [3H]Mesulergine from human 5-HT2C receptor expressed in Flp-IN HEK cells after 90 mins by scintillation counting method
J Med Chem 60: 7146-7165 (2017)
Article DOI: 10.1021/acs.jmedchem.7b00835
BindingDB Entry DOI: 10.7270/Q2639S64
5-hydroxytryptamine receptor 5A
(Homo sapiens (Human))
BDBM50449038
(CHEMBL3126204 | US9212144, 15 (Ex. 17))
Show SMILES Nc1ccc2ccc(CCNCCc3cccc(Cl)c3)cc2n1
Show InChI InChI=1S/C19H20ClN3/c20-17-3-1-2-14(12-17)8-10-22-11-9-15-4-5-16-6-7-19(21)23-18(16)13-15/h1-7,12-13,22H,8-11H2,(H2,21,23)
<100n/an/an/an/an/an/an/an/a
Department of Chemistry, Department of Molecular Biosciences, Chemistry of Life Processes Institute, Center for Molecular Innovation and Drug Discovery, Northwestern University , Evanston, Illinois 6
Curated by ChEMBL
Assay Description
Displacement of [3H]LSD from human 5-HT5A receptor expressed in Flp-In CHO cells after 90 mins by scintillation counting method
J Med Chem 60: 7146-7165 (2017)
Article DOI: 10.1021/acs.jmedchem.7b00835
BindingDB Entry DOI: 10.7270/Q2639S64
Kappa-type opioid receptor
(Homo sapiens (Human))
BDBM50449038
(CHEMBL3126204 | US9212144, 15 (Ex. 17))
Show SMILES Nc1ccc2ccc(CCNCCc3cccc(Cl)c3)cc2n1
Show InChI InChI=1S/C19H20ClN3/c20-17-3-1-2-14(12-17)8-10-22-11-9-15-4-5-16-6-7-19(21)23-18(16)13-15/h1-7,12-13,22H,8-11H2,(H2,21,23)
Reactome pathway
<100n/an/an/an/an/an/an/an/a
Department of Chemistry, Department of Molecular Biosciences, Chemistry of Life Processes Institute, Center for Molecular Innovation and Drug Discovery, Northwestern University , Evanston, Illinois 6
Curated by ChEMBL
Assay Description
Displacement of [3H]U69593 from human kappa opioid receptor expressed in HEK cells after 90 mins by scintillation counting method
J Med Chem 60: 7146-7165 (2017)
Article DOI: 10.1021/acs.jmedchem.7b00835
BindingDB Entry DOI: 10.7270/Q2639S64
Histamine H2 receptor
(Homo sapiens (Human))
BDBM50449038
(CHEMBL3126204 | US9212144, 15 (Ex. 17))
Show SMILES Nc1ccc2ccc(CCNCCc3cccc(Cl)c3)cc2n1
Show InChI InChI=1S/C19H20ClN3/c20-17-3-1-2-14(12-17)8-10-22-11-9-15-4-5-16-6-7-19(21)23-18(16)13-15/h1-7,12-13,22H,8-11H2,(H2,21,23)
Reactome pathway
<100n/an/an/an/an/an/an/an/a
Department of Chemistry, Department of Molecular Biosciences, Chemistry of Life Processes Institute, Center for Molecular Innovation and Drug Discovery, Northwestern University , Evanston, Illinois 6
Curated by ChEMBL
Assay Description
Displacement of [3H]Tiotidine from human H2 receptor expressed in HEK cells after 90 mins by scintillation counting method
J Med Chem 60: 7146-7165 (2017)
Article DOI: 10.1021/acs.jmedchem.7b00835
BindingDB Entry DOI: 10.7270/Q2639S64
5-hydroxytryptamine receptor 1A
(Homo sapiens (Human))
BDBM50449038
(CHEMBL3126204 | US9212144, 15 (Ex. 17))
Show SMILES Nc1ccc2ccc(CCNCCc3cccc(Cl)c3)cc2n1
Show InChI InChI=1S/C19H20ClN3/c20-17-3-1-2-14(12-17)8-10-22-11-9-15-4-5-16-6-7-19(21)23-18(16)13-15/h1-7,12-13,22H,8-11H2,(H2,21,23)
<100n/an/an/an/an/an/an/an/a
Department of Chemistry, Department of Molecular Biosciences, Chemistry of Life Processes Institute, Center for Molecular Innovation and Drug Discovery, Northwestern University , Evanston, Illinois 6
Curated by ChEMBL
Assay Description
Displacement of [3H]Way100635 from human 5-HT1a receptor expressed in CHO cells after 90 mins by scintillation counting method
J Med Chem 60: 7146-7165 (2017)
Article DOI: 10.1021/acs.jmedchem.7b00835
BindingDB Entry DOI: 10.7270/Q2639S64
5-hydroxytryptamine receptor 6
(Homo sapiens (Human))
BDBM50449038
(CHEMBL3126204 | US9212144, 15 (Ex. 17))
Show SMILES Nc1ccc2ccc(CCNCCc3cccc(Cl)c3)cc2n1
Show InChI InChI=1S/C19H20ClN3/c20-17-3-1-2-14(12-17)8-10-22-11-9-15-4-5-16-6-7-19(21)23-18(16)13-15/h1-7,12-13,22H,8-11H2,(H2,21,23)
Reactome pathway
<100n/an/an/an/an/an/an/an/a
Department of Chemistry, Department of Molecular Biosciences, Chemistry of Life Processes Institute, Center for Molecular Innovation and Drug Discovery, Northwestern University , Evanston, Illinois 6
Curated by ChEMBL
Assay Description
Displacement of [3H]LSD from human 5-HT6 receptor expressed in HEK cells after 90 mins by scintillation counting method
J Med Chem 60: 7146-7165 (2017)
Article DOI: 10.1021/acs.jmedchem.7b00835
BindingDB Entry DOI: 10.7270/Q2639S64
5-hydroxytryptamine receptor 7
(Homo sapiens (Human))
BDBM50449038
(CHEMBL3126204 | US9212144, 15 (Ex. 17))
Show SMILES Nc1ccc2ccc(CCNCCc3cccc(Cl)c3)cc2n1
Show InChI InChI=1S/C19H20ClN3/c20-17-3-1-2-14(12-17)8-10-22-11-9-15-4-5-16-6-7-19(21)23-18(16)13-15/h1-7,12-13,22H,8-11H2,(H2,21,23)
Reactome pathway
<100n/an/an/an/an/an/an/an/a
Department of Chemistry, Department of Molecular Biosciences, Chemistry of Life Processes Institute, Center for Molecular Innovation and Drug Discovery, Northwestern University , Evanston, Illinois 6
Curated by ChEMBL
Assay Description
Displacement of [3H]LSD from human 5-HT7A receptor expressed in HEK cells after 90 mins by scintillation counting method
J Med Chem 60: 7146-7165 (2017)
Article DOI: 10.1021/acs.jmedchem.7b00835
BindingDB Entry DOI: 10.7270/Q2639S64
Delta-type opioid receptor
(Homo sapiens (Human))
BDBM50449038
(CHEMBL3126204 | US9212144, 15 (Ex. 17))
Show SMILES Nc1ccc2ccc(CCNCCc3cccc(Cl)c3)cc2n1
Show InChI InChI=1S/C19H20ClN3/c20-17-3-1-2-14(12-17)8-10-22-11-9-15-4-5-16-6-7-19(21)23-18(16)13-15/h1-7,12-13,22H,8-11H2,(H2,21,23)
Reactome pathway
<100n/an/an/an/an/an/an/an/a
Department of Chemistry, Department of Molecular Biosciences, Chemistry of Life Processes Institute, Center for Molecular Innovation and Drug Discovery, Northwestern University , Evanston, Illinois 6
Curated by ChEMBL
Assay Description
Displacement of [3H]DADLE from human delta opioid receptor expressed in HEK cells after 90 mins by scintillation counting method
J Med Chem 60: 7146-7165 (2017)
Article DOI: 10.1021/acs.jmedchem.7b00835
BindingDB Entry DOI: 10.7270/Q2639S64
Histamine H1 receptor
(Homo sapiens (Human))
BDBM50449038
(CHEMBL3126204 | US9212144, 15 (Ex. 17))
Show SMILES Nc1ccc2ccc(CCNCCc3cccc(Cl)c3)cc2n1
Show InChI InChI=1S/C19H20ClN3/c20-17-3-1-2-14(12-17)8-10-22-11-9-15-4-5-16-6-7-19(21)23-18(16)13-15/h1-7,12-13,22H,8-11H2,(H2,21,23)
Reactome pathway
<100n/an/an/an/an/an/an/an/a
Department of Chemistry, Department of Molecular Biosciences, Chemistry of Life Processes Institute, Center for Molecular Innovation and Drug Discovery, Northwestern University , Evanston, Illinois 6
Curated by ChEMBL
Assay Description
Displacement of [3H]Pyrilamine from human H1 receptor expressed in HEK cells after 90 mins by scintillation counting method
J Med Chem 60: 7146-7165 (2017)
Article DOI: 10.1021/acs.jmedchem.7b00835
BindingDB Entry DOI: 10.7270/Q2639S64
Nociceptin receptor
(Homo sapiens (Human))
BDBM50449038
(CHEMBL3126204 | US9212144, 15 (Ex. 17))
Show SMILES Nc1ccc2ccc(CCNCCc3cccc(Cl)c3)cc2n1
Show InChI InChI=1S/C19H20ClN3/c20-17-3-1-2-14(12-17)8-10-22-11-9-15-4-5-16-6-7-19(21)23-18(16)13-15/h1-7,12-13,22H,8-11H2,(H2,21,23)
Reactome pathway
<100n/an/an/an/an/an/an/an/a
Department of Chemistry, Department of Molecular Biosciences, Chemistry of Life Processes Institute, Center for Molecular Innovation and Drug Discovery, Northwestern University , Evanston, Illinois 6
Curated by ChEMBL
Assay Description
Displacement of [3H]N/OFQ from human nociceptin opioid receptor expressed in HEK cells after 90 mins by scintillation counting method
J Med Chem 60: 7146-7165 (2017)
Article DOI: 10.1021/acs.jmedchem.7b00835
BindingDB Entry DOI: 10.7270/Q2639S64
Histamine H3 receptor
(Homo sapiens (Human))
BDBM50449038
(CHEMBL3126204 | US9212144, 15 (Ex. 17))
Show SMILES Nc1ccc2ccc(CCNCCc3cccc(Cl)c3)cc2n1
Show InChI InChI=1S/C19H20ClN3/c20-17-3-1-2-14(12-17)8-10-22-11-9-15-4-5-16-6-7-19(21)23-18(16)13-15/h1-7,12-13,22H,8-11H2,(H2,21,23)
Reactome pathway
<100n/an/an/an/an/an/an/an/a
Department of Chemistry, Department of Molecular Biosciences, Chemistry of Life Processes Institute, Center for Molecular Innovation and Drug Discovery, Northwestern University , Evanston, Illinois 6
Curated by ChEMBL
Assay Description
Displacement of [3H]alpha-methylhistamine from human H3 receptor expressed in HEK Flp-In cells after 90 mins by scintillation counting method
J Med Chem 60: 7146-7165 (2017)
Article DOI: 10.1021/acs.jmedchem.7b00835
BindingDB Entry DOI: 10.7270/Q2639S64
Histamine H4 receptor
(Homo sapiens (Human))
BDBM50449038
(CHEMBL3126204 | US9212144, 15 (Ex. 17))
Show SMILES Nc1ccc2ccc(CCNCCc3cccc(Cl)c3)cc2n1
Show InChI InChI=1S/C19H20ClN3/c20-17-3-1-2-14(12-17)8-10-22-11-9-15-4-5-16-6-7-19(21)23-18(16)13-15/h1-7,12-13,22H,8-11H2,(H2,21,23)
Reactome pathway
<100n/an/an/an/an/an/an/an/a
Department of Chemistry, Department of Molecular Biosciences, Chemistry of Life Processes Institute, Center for Molecular Innovation and Drug Discovery, Northwestern University , Evanston, Illinois 6
Curated by ChEMBL
Assay Description
Displacement of [3H]Histamine from human H4 receptor after 90 mins by scintillation counting method
J Med Chem 60: 7146-7165 (2017)
Article DOI: 10.1021/acs.jmedchem.7b00835
BindingDB Entry DOI: 10.7270/Q2639S64
Serotonin (5-HT) receptor
(Homo sapiens (Human))
BDBM50449038
(CHEMBL3126204 | US9212144, 15 (Ex. 17))
Show SMILES Nc1ccc2ccc(CCNCCc3cccc(Cl)c3)cc2n1
Show InChI InChI=1S/C19H20ClN3/c20-17-3-1-2-14(12-17)8-10-22-11-9-15-4-5-16-6-7-19(21)23-18(16)13-15/h1-7,12-13,22H,8-11H2,(H2,21,23)
Reactome pathway
<100n/an/an/an/an/an/an/an/a
Department of Chemistry, Department of Molecular Biosciences, Chemistry of Life Processes Institute, Center for Molecular Innovation and Drug Discovery, Northwestern University , Evanston, Illinois 6
Curated by ChEMBL
Assay Description
Displacement of [3H]5-CT from human 5-HT1B receptor expressed in HEK cells after 90 mins by scintillation counting method
J Med Chem 60: 7146-7165 (2017)
Article DOI: 10.1021/acs.jmedchem.7b00835
BindingDB Entry DOI: 10.7270/Q2639S64
Serotonin (5-HT) receptor
(Homo sapiens (Human))
BDBM50449038
(CHEMBL3126204 | US9212144, 15 (Ex. 17))
Show SMILES Nc1ccc2ccc(CCNCCc3cccc(Cl)c3)cc2n1
Show InChI InChI=1S/C19H20ClN3/c20-17-3-1-2-14(12-17)8-10-22-11-9-15-4-5-16-6-7-19(21)23-18(16)13-15/h1-7,12-13,22H,8-11H2,(H2,21,23)
Reactome pathway
<100n/an/an/an/an/an/an/an/a
Department of Chemistry, Department of Molecular Biosciences, Chemistry of Life Processes Institute, Center for Molecular Innovation and Drug Discovery, Northwestern University , Evanston, Illinois 6
Curated by ChEMBL
Assay Description
Displacement of [3H]5-CT from human 5-HT1D receptor expressed in HEKT cells after 90 mins by scintillation counting method
J Med Chem 60: 7146-7165 (2017)
Article DOI: 10.1021/acs.jmedchem.7b00835
BindingDB Entry DOI: 10.7270/Q2639S64
Serotonin (5-HT) receptor
(Homo sapiens (Human))
BDBM50449038
(CHEMBL3126204 | US9212144, 15 (Ex. 17))
Show SMILES Nc1ccc2ccc(CCNCCc3cccc(Cl)c3)cc2n1
Show InChI InChI=1S/C19H20ClN3/c20-17-3-1-2-14(12-17)8-10-22-11-9-15-4-5-16-6-7-19(21)23-18(16)13-15/h1-7,12-13,22H,8-11H2,(H2,21,23)
<100n/an/an/an/an/an/an/an/a
Department of Chemistry, Department of Molecular Biosciences, Chemistry of Life Processes Institute, Center for Molecular Innovation and Drug Discovery, Northwestern University , Evanston, Illinois 6
Curated by ChEMBL
Assay Description
Displacement of [3H]GR113808 from human 5-HT4 receptor after 90 mins by scintillation counting method
J Med Chem 60: 7146-7165 (2017)
Article DOI: 10.1021/acs.jmedchem.7b00835
BindingDB Entry DOI: 10.7270/Q2639S64
5-hydroxytryptamine receptor 3A
(Homo sapiens (Human))
BDBM50449038
(CHEMBL3126204 | US9212144, 15 (Ex. 17))
Show SMILES Nc1ccc2ccc(CCNCCc3cccc(Cl)c3)cc2n1
Show InChI InChI=1S/C19H20ClN3/c20-17-3-1-2-14(12-17)8-10-22-11-9-15-4-5-16-6-7-19(21)23-18(16)13-15/h1-7,12-13,22H,8-11H2,(H2,21,23)
Reactome pathway
<100n/an/an/an/an/an/an/an/a
Department of Chemistry, Department of Molecular Biosciences, Chemistry of Life Processes Institute, Center for Molecular Innovation and Drug Discovery, Northwestern University , Evanston, Illinois 6
Curated by ChEMBL
Assay Description
Displacement of [3H]GR65630 from human 5-HT3 receptor expressed in HEKT cells after 90 mins by scintillation counting method
J Med Chem 60: 7146-7165 (2017)
Article DOI: 10.1021/acs.jmedchem.7b00835
BindingDB Entry DOI: 10.7270/Q2639S64
5-hydroxytryptamine receptor 2B
(Homo sapiens (Human))
BDBM50449038
(CHEMBL3126204 | US9212144, 15 (Ex. 17))
Show SMILES Nc1ccc2ccc(CCNCCc3cccc(Cl)c3)cc2n1
Show InChI InChI=1S/C19H20ClN3/c20-17-3-1-2-14(12-17)8-10-22-11-9-15-4-5-16-6-7-19(21)23-18(16)13-15/h1-7,12-13,22H,8-11H2,(H2,21,23)
Reactome pathway
<100n/an/an/an/an/an/an/an/a
Department of Chemistry, Department of Molecular Biosciences, Chemistry of Life Processes Institute, Center for Molecular Innovation and Drug Discovery, Northwestern University , Evanston, Illinois 6
Curated by ChEMBL
Assay Description
Displacement of [3H]LSD from human 5-HT2B receptor expressed in HEK cells after 90 mins by scintillation counting method
J Med Chem 60: 7146-7165 (2017)
Article DOI: 10.1021/acs.jmedchem.7b00835
BindingDB Entry DOI: 10.7270/Q2639S64
5-hydroxytryptamine receptor 2A
(Homo sapiens (Human))
BDBM50449038
(CHEMBL3126204 | US9212144, 15 (Ex. 17))
Show SMILES Nc1ccc2ccc(CCNCCc3cccc(Cl)c3)cc2n1
Show InChI InChI=1S/C19H20ClN3/c20-17-3-1-2-14(12-17)8-10-22-11-9-15-4-5-16-6-7-19(21)23-18(16)13-15/h1-7,12-13,22H,8-11H2,(H2,21,23)
Reactome pathway
<100n/an/an/an/an/an/an/an/a
Department of Chemistry, Department of Molecular Biosciences, Chemistry of Life Processes Institute, Center for Molecular Innovation and Drug Discovery, Northwestern University , Evanston, Illinois 6
Curated by ChEMBL
Assay Description
Displacement of [3H]Ketanserin from human 5-HT2A receptor expressed in HEKT cells after 90 mins by scintillation counting method
J Med Chem 60: 7146-7165 (2017)
Article DOI: 10.1021/acs.jmedchem.7b00835
BindingDB Entry DOI: 10.7270/Q2639S64
Serotonin (5-HT) receptor
(Homo sapiens (Human))
BDBM50449038
(CHEMBL3126204 | US9212144, 15 (Ex. 17))
Show SMILES Nc1ccc2ccc(CCNCCc3cccc(Cl)c3)cc2n1
Show InChI InChI=1S/C19H20ClN3/c20-17-3-1-2-14(12-17)8-10-22-11-9-15-4-5-16-6-7-19(21)23-18(16)13-15/h1-7,12-13,22H,8-11H2,(H2,21,23)
Reactome pathway
<100n/an/an/an/an/an/an/an/a
Department of Chemistry, Department of Molecular Biosciences, Chemistry of Life Processes Institute, Center for Molecular Innovation and Drug Discovery, Northwestern University , Evanston, Illinois 6
Curated by ChEMBL
Assay Description
Binding affinity to human 5-HT1F receptor
J Med Chem 60: 7146-7165 (2017)
Article DOI: 10.1021/acs.jmedchem.7b00835
BindingDB Entry DOI: 10.7270/Q2639S64
Nitric oxide synthase, brain
(Homo sapiens (Human))
BDBM50449038
(CHEMBL3126204 | US9212144, 15 (Ex. 17))
Show SMILES Nc1ccc2ccc(CCNCCc3cccc(Cl)c3)cc2n1
Show InChI InChI=1S/C19H20ClN3/c20-17-3-1-2-14(12-17)8-10-22-11-9-15-4-5-16-6-7-19(21)23-18(16)13-15/h1-7,12-13,22H,8-11H2,(H2,21,23)
Reactome pathway
440n/an/an/an/an/an/an/an/a
Department of Chemistry, Department of Molecular Biosciences, Chemistry of Life Processes Institute, Center for Molecular Innovation and Drug Discovery, Northwestern University , Evanston, Illinois 6
Curated by ChEMBL
Assay Description
Inhibition of recombinant human nNOS expressed in Escherichia coli using L-arginine as substrate after 30 secs by hemoglobin capture assay
J Med Chem 60: 7146-7165 (2017)
Article DOI: 10.1021/acs.jmedchem.7b00835
BindingDB Entry DOI: 10.7270/Q2639S64
3D
3D Structure (crystal)
Nitric oxide synthase, brain
(Homo sapiens (Human))
BDBM50449038
(CHEMBL3126204 | US9212144, 15 (Ex. 17))
Show SMILES Nc1ccc2ccc(CCNCCc3cccc(Cl)c3)cc2n1
Show InChI InChI=1S/C19H20ClN3/c20-17-3-1-2-14(12-17)8-10-22-11-9-15-4-5-16-6-7-19(21)23-18(16)13-15/h1-7,12-13,22H,8-11H2,(H2,21,23)
Reactome pathway
440n/an/an/an/an/an/an/an/a
Northwestern University
Curated by ChEMBL
Assay Description
Inhibition of recombinant human full-length nNOS expressed in Escherichia coli BL21(DE3) assessed as reduction in nitric oxide production using L-arg...
J Med Chem 60: 3958-3978 (2017)
Article DOI: 10.1021/acs.jmedchem.7b00259
BindingDB Entry DOI: 10.7270/Q2RV0R5D
3D
3D Structure (crystal)
Nitric oxide synthase, brain
(Homo sapiens (Human))
BDBM50449038
(CHEMBL3126204 | US9212144, 15 (Ex. 17))
Show SMILES Nc1ccc2ccc(CCNCCc3cccc(Cl)c3)cc2n1
Show InChI InChI=1S/C19H20ClN3/c20-17-3-1-2-14(12-17)8-10-22-11-9-15-4-5-16-6-7-19(21)23-18(16)13-15/h1-7,12-13,22H,8-11H2,(H2,21,23)
Reactome pathway
440n/an/an/an/an/an/an/an/a
Northwestern University
Curated by ChEMBL
Assay Description
Inhibition of recombinant human nNOS expressed in Escherichia coli assessed as nitric oxide production by hemoglobin capture assay
J Med Chem 58: 8694-712 (2015)
Article DOI: 10.1021/acs.jmedchem.5b01330
BindingDB Entry DOI: 10.7270/Q2R214C3
3D
3D Structure (crystal)
Nitric oxide synthase, brain
(Homo sapiens (Human))
BDBM50449038
(CHEMBL3126204 | US9212144, 15 (Ex. 17))
Show SMILES Nc1ccc2ccc(CCNCCc3cccc(Cl)c3)cc2n1
Show InChI InChI=1S/C19H20ClN3/c20-17-3-1-2-14(12-17)8-10-22-11-9-15-4-5-16-6-7-19(21)23-18(16)13-15/h1-7,12-13,22H,8-11H2,(H2,21,23)
Reactome pathway
US Patent
440n/an/an/an/an/an/a7.4n/a
Northwestern University
US Patent
Assay Description
To test for enzyme inhibition, the hemoglobin capture assay was used to measure nitric oxide production. The assay was performed at 37° C. in HEPES b...
US Patent US9212144 (2015)
BindingDB Entry DOI: 10.7270/Q2K0732P
3D
3D Structure (crystal)
Nitric oxide synthase, brain
(Homo sapiens (Human))
BDBM50449038
(CHEMBL3126204 | US9212144, 15 (Ex. 17))
Show SMILES Nc1ccc2ccc(CCNCCc3cccc(Cl)c3)cc2n1
Show InChI InChI=1S/C19H20ClN3/c20-17-3-1-2-14(12-17)8-10-22-11-9-15-4-5-16-6-7-19(21)23-18(16)13-15/h1-7,12-13,22H,8-11H2,(H2,21,23)
Reactome pathway
440n/an/an/an/an/an/an/an/a
Northwestern University
Curated by ChEMBL
Assay Description
Inhibition of human nNOS expressed in Escherichia coli expression system assessed as reduction in NO production in presence of L-arginine measured fo...
J Med Chem 63: 4528-4554 (2020)
Article DOI: 10.1021/acs.jmedchem.9b01573
3D
3D Structure (crystal)
Nitric-oxide synthase, endothelial
(Bos taurus (bovine))
BDBM50449038
(CHEMBL3126204 | US9212144, 15 (Ex. 17))
Show SMILES Nc1ccc2ccc(CCNCCc3cccc(Cl)c3)cc2n1
Show InChI InChI=1S/C19H20ClN3/c20-17-3-1-2-14(12-17)8-10-22-11-9-15-4-5-16-6-7-19(21)23-18(16)13-15/h1-7,12-13,22H,8-11H2,(H2,21,23)
7.24E+3n/an/an/an/an/an/an/an/a
Northwestern University
Curated by ChEMBL
Assay Description
Inhibition of recombinant bovine eNOS expressed in Escherichia coli assessed as nitric oxide production by hemoglobin capture assay
J Med Chem 58: 8694-712 (2015)
Article DOI: 10.1021/acs.jmedchem.5b01330
BindingDB Entry DOI: 10.7270/Q2R214C3
Nitric Oxide Synthase, endothelial
(Bos taurus (bovine))
BDBM50449038
(CHEMBL3126204 | US9212144, 15 (Ex. 17))
Show SMILES Nc1ccc2ccc(CCNCCc3cccc(Cl)c3)cc2n1
Show InChI InChI=1S/C19H20ClN3/c20-17-3-1-2-14(12-17)8-10-22-11-9-15-4-5-16-6-7-19(21)23-18(16)13-15/h1-7,12-13,22H,8-11H2,(H2,21,23)
US Patent
7.24E+3n/an/an/an/an/an/a7.4n/a
Northwestern University
US Patent
Assay Description
To test for enzyme inhibition, the hemoglobin capture assay was used to measure nitric oxide production. The assay was performed at 37° C. in HEPES b...
US Patent US9212144 (2015)
BindingDB Entry DOI: 10.7270/Q2K0732P
Nitric Oxide Synthase, endothelial
(Bos taurus (bovine))
BDBM50449038
(CHEMBL3126204 | US9212144, 15 (Ex. 17))
Show SMILES Nc1ccc2ccc(CCNCCc3cccc(Cl)c3)cc2n1
Show InChI InChI=1S/C19H20ClN3/c20-17-3-1-2-14(12-17)8-10-22-11-9-15-4-5-16-6-7-19(21)23-18(16)13-15/h1-7,12-13,22H,8-11H2,(H2,21,23)
7.24E+3n/an/an/an/an/an/an/an/a
Northwestern University
Curated by ChEMBL
Assay Description
Inhibition of bovine recombinant eNOS expressed in Escherichia coli using L-arginine as substrate assessed as NO production by hemoglobin capture ass...
J Med Chem 57: 1513-30 (2014)
Article DOI: 10.1021/jm401838x
BindingDB Entry DOI: 10.7270/Q2MP54SZ
Nitric-oxide synthase, endothelial
(Bos taurus (bovine))
BDBM50449038
(CHEMBL3126204 | US9212144, 15 (Ex. 17))
Show SMILES Nc1ccc2ccc(CCNCCc3cccc(Cl)c3)cc2n1
Show InChI InChI=1S/C19H20ClN3/c20-17-3-1-2-14(12-17)8-10-22-11-9-15-4-5-16-6-7-19(21)23-18(16)13-15/h1-7,12-13,22H,8-11H2,(H2,21,23)
7.24E+3n/an/an/an/an/an/an/an/a
Department of Chemistry, Department of Molecular Biosciences, Chemistry of Life Processes Institute, Center for Molecular Innovation and Drug Discovery, Northwestern University , Evanston, Illinois 6
Curated by ChEMBL
Assay Description
Inhibition of recombinant bovine eNOS expressed in Escherichia coli using L-arginine as substrate after 30 secs by hemoglobin capture assay
J Med Chem 60: 7146-7165 (2017)
Article DOI: 10.1021/acs.jmedchem.7b00835
BindingDB Entry DOI: 10.7270/Q2639S64
Nitric oxide synthase, endothelial
(Homo sapiens (Human))
BDBM50449038
(CHEMBL3126204 | US9212144, 15 (Ex. 17))
Show SMILES Nc1ccc2ccc(CCNCCc3cccc(Cl)c3)cc2n1
Show InChI InChI=1S/C19H20ClN3/c20-17-3-1-2-14(12-17)8-10-22-11-9-15-4-5-16-6-7-19(21)23-18(16)13-15/h1-7,12-13,22H,8-11H2,(H2,21,23)
1.18E+4n/an/an/an/an/an/an/an/a
Northwestern University
Curated by ChEMBL
Assay Description
Inhibition of recombinant human full-length eNOS expressed in Escherichia coli BL21(DE3) assessed as reduction in nitric oxide production using L-arg...
J Med Chem 60: 3958-3978 (2017)
Article DOI: 10.1021/acs.jmedchem.7b00259
BindingDB Entry DOI: 10.7270/Q2RV0R5D
Nitric oxide synthase, endothelial
(Homo sapiens (Human))
BDBM50449038
(CHEMBL3126204 | US9212144, 15 (Ex. 17))
Show SMILES Nc1ccc2ccc(CCNCCc3cccc(Cl)c3)cc2n1
Show InChI InChI=1S/C19H20ClN3/c20-17-3-1-2-14(12-17)8-10-22-11-9-15-4-5-16-6-7-19(21)23-18(16)13-15/h1-7,12-13,22H,8-11H2,(H2,21,23)
1.18E+4n/an/an/an/an/an/an/an/a
Northwestern University
Curated by ChEMBL
Assay Description
Inhibition of human eNOS expressed in Escherichia coli expression system assessed as reduction in NO production in presence of L-arginine measured fo...
J Med Chem 63: 4528-4554 (2020)
Article DOI: 10.1021/acs.jmedchem.9b01573
Nitric oxide synthase, endothelial
(Homo sapiens (Human))
BDBM50449038
(CHEMBL3126204 | US9212144, 15 (Ex. 17))
Show SMILES Nc1ccc2ccc(CCNCCc3cccc(Cl)c3)cc2n1
Show InChI InChI=1S/C19H20ClN3/c20-17-3-1-2-14(12-17)8-10-22-11-9-15-4-5-16-6-7-19(21)23-18(16)13-15/h1-7,12-13,22H,8-11H2,(H2,21,23)
1.18E+4n/an/an/an/an/an/an/an/a
Department of Chemistry, Department of Molecular Biosciences, Chemistry of Life Processes Institute, Center for Molecular Innovation and Drug Discovery, Northwestern University , Evanston, Illinois 6
Curated by ChEMBL
Assay Description
Inhibition of recombinant human eNOS expressed in Escherichia coli using L-arginine as substrate after 30 secs by hemoglobin capture assay
J Med Chem 60: 7146-7165 (2017)
Article DOI: 10.1021/acs.jmedchem.7b00835
BindingDB Entry DOI: 10.7270/Q2639S64
Nitric Oxide Synthase, inducible
(Mus musculus (mouse))
BDBM50449038
(CHEMBL3126204 | US9212144, 15 (Ex. 17))
Show SMILES Nc1ccc2ccc(CCNCCc3cccc(Cl)c3)cc2n1
Show InChI InChI=1S/C19H20ClN3/c20-17-3-1-2-14(12-17)8-10-22-11-9-15-4-5-16-6-7-19(21)23-18(16)13-15/h1-7,12-13,22H,8-11H2,(H2,21,23)
Reactome pathway
2.84E+4n/an/an/an/an/an/an/an/a
Northwestern University
Curated by ChEMBL
Assay Description
Inhibition of mouse recombinant iNOS expressed in Escherichia coli using L-arginine as substrate assessed as NO production by hemoglobin capture assa...
J Med Chem 57: 1513-30 (2014)
Article DOI: 10.1021/jm401838x
BindingDB Entry DOI: 10.7270/Q2MP54SZ
Nitric Oxide Synthase, inducible
(Mus musculus (mouse))
BDBM50449038
(CHEMBL3126204 | US9212144, 15 (Ex. 17))
Show SMILES Nc1ccc2ccc(CCNCCc3cccc(Cl)c3)cc2n1
Show InChI InChI=1S/C19H20ClN3/c20-17-3-1-2-14(12-17)8-10-22-11-9-15-4-5-16-6-7-19(21)23-18(16)13-15/h1-7,12-13,22H,8-11H2,(H2,21,23)
Reactome pathway
US Patent
2.84E+4n/an/an/an/an/an/a7.4n/a
Northwestern University
US Patent
Assay Description
To test for enzyme inhibition, the hemoglobin capture assay was used to measure nitric oxide production. The assay was performed at 37° C. in HEPES b...
US Patent US9212144 (2015)
BindingDB Entry DOI: 10.7270/Q2K0732P
Nitric oxide synthase, inducible
(Mus musculus (mouse))
BDBM50449038
(CHEMBL3126204 | US9212144, 15 (Ex. 17))
Show SMILES Nc1ccc2ccc(CCNCCc3cccc(Cl)c3)cc2n1
Show InChI InChI=1S/C19H20ClN3/c20-17-3-1-2-14(12-17)8-10-22-11-9-15-4-5-16-6-7-19(21)23-18(16)13-15/h1-7,12-13,22H,8-11H2,(H2,21,23)
Reactome pathway
2.84E+4n/an/an/an/an/an/an/an/a
Northwestern University
Curated by ChEMBL
Assay Description
Inhibition of recombinant mouse macrophage iNOS expressed in Escherichia coli assessed as reduction in nitric oxide production using L-arginine as su...
J Med Chem 60: 3958-3978 (2017)
Article DOI: 10.1021/acs.jmedchem.7b00259
BindingDB Entry DOI: 10.7270/Q2RV0R5D
Nitric oxide synthase, inducible
(Mus musculus (mouse))
BDBM50449038
(CHEMBL3126204 | US9212144, 15 (Ex. 17))
Show SMILES Nc1ccc2ccc(CCNCCc3cccc(Cl)c3)cc2n1
Show InChI InChI=1S/C19H20ClN3/c20-17-3-1-2-14(12-17)8-10-22-11-9-15-4-5-16-6-7-19(21)23-18(16)13-15/h1-7,12-13,22H,8-11H2,(H2,21,23)
Reactome pathway
2.84E+4n/an/an/an/an/an/an/an/a
Northwestern University
Curated by ChEMBL
Assay Description
Inhibition of recombinant murine iNOS expressed in Escherichia coli assessed as nitric oxide production by hemoglobin capture assay
J Med Chem 58: 8694-712 (2015)
Article DOI: 10.1021/acs.jmedchem.5b01330
BindingDB Entry DOI: 10.7270/Q2R214C3
Nitric oxide synthase, inducible
(Mus musculus (mouse))
BDBM50449038
(CHEMBL3126204 | US9212144, 15 (Ex. 17))
Show SMILES Nc1ccc2ccc(CCNCCc3cccc(Cl)c3)cc2n1
Show InChI InChI=1S/C19H20ClN3/c20-17-3-1-2-14(12-17)8-10-22-11-9-15-4-5-16-6-7-19(21)23-18(16)13-15/h1-7,12-13,22H,8-11H2,(H2,21,23)
Reactome pathway
2.84E+4n/an/an/an/an/an/an/an/a
Northwestern University
Curated by ChEMBL
Assay Description
Inhibition of mouse iNOS expressed in Escherichia coli expression system assessed as reduction in NO production in presence of L-arginine measured fo...
J Med Chem 63: 4528-4554 (2020)
Article DOI: 10.1021/acs.jmedchem.9b01573
Nitric oxide synthase, inducible
(Mus musculus (mouse))
BDBM50449038
(CHEMBL3126204 | US9212144, 15 (Ex. 17))
Show SMILES Nc1ccc2ccc(CCNCCc3cccc(Cl)c3)cc2n1
Show InChI InChI=1S/C19H20ClN3/c20-17-3-1-2-14(12-17)8-10-22-11-9-15-4-5-16-6-7-19(21)23-18(16)13-15/h1-7,12-13,22H,8-11H2,(H2,21,23)
Reactome pathway
2.84E+4n/an/an/an/an/an/an/an/a
Department of Chemistry, Department of Molecular Biosciences, Chemistry of Life Processes Institute, Center for Molecular Innovation and Drug Discovery, Northwestern University , Evanston, Illinois 6
Curated by ChEMBL
Assay Description
Inhibition of recombinant mouse macrophage iNOS expressed in Escherichia coli using L-arginine as substrate after 30 secs by hemoglobin capture assay
J Med Chem 60: 7146-7165 (2017)
Article DOI: 10.1021/acs.jmedchem.7b00835
BindingDB Entry DOI: 10.7270/Q2639S64