BDBM50449057 CHEMBL3126948
SMILES: Cc1ccc(F)cc1C(C)(C)C[C@@](O)(Cc1cc2nnccc2[nH]1)C(F)(F)F
InChI Key: InChIKey=ABDAGDDZOUDCKI-IBGZPJMESA-N
Data: 4 IC50
Activity Spreadsheet -- Enzyme Inhibition Constant Data from BindingDB
Found 4 hits for monomerid = 50449057
Trg + Lig
Ki
nM
ΔG°
kcal/mole
IC50
nM
Kd
nM
EC50/IC50
nM
koff
s-1
kon
M-1s-1
pHTemp
°C
Progesterone receptor
(Homo sapiens (Human))
BDBM50449057
(CHEMBL3126948)
Show SMILES Cc1ccc(F)cc1C(C)(C)C[C@@](O)(Cc1cc2nnccc2[nH]1)C(F)(F)F |r|
Show InChI InChI=1S/C20H21F4N3O/c1-12-4-5-13(21)8-15(12)18(2,3)11-19(28,20(22,23)24)10-14-9-17-16(26-14)6-7-25-27-17/h4-9,26,28H,10-11H2,1-3H3/t19-/m0/s1
n/an/a>2.00E+3n/an/an/an/an/an/a
Boehringer Ingelheim Pharmaceuticals
Curated by ChEMBL
Assay Description
Competitive binding affinity to progesterone receptor (unknown origin) expressed in baculovirus-infected cell system after 1 hr by fluorescence polar...
J Med Chem 57: 1583-98 (2014)
Article DOI: 10.1021/jm4019178
BindingDB Entry DOI: 10.7270/Q23N24W5
Mineralocorticoid receptor
(Homo sapiens (Human))
BDBM50449057
(CHEMBL3126948)
Show SMILES Cc1ccc(F)cc1C(C)(C)C[C@@](O)(Cc1cc2nnccc2[nH]1)C(F)(F)F |r|
Show InChI InChI=1S/C20H21F4N3O/c1-12-4-5-13(21)8-15(12)18(2,3)11-19(28,20(22,23)24)10-14-9-17-16(26-14)6-7-25-27-17/h4-9,26,28H,10-11H2,1-3H3/t19-/m0/s1
n/an/a 260n/an/an/an/an/an/a
Boehringer Ingelheim Pharmaceuticals
Curated by ChEMBL
Assay Description
Competitive binding affinity to mineralocorticoid receptor (unknown origin) expressed in baculovirus-infected cell system after 1 hr by fluorescence ...
J Med Chem 57: 1583-98 (2014)
Article DOI: 10.1021/jm4019178
BindingDB Entry DOI: 10.7270/Q23N24W5
Glucocorticoid receptor
(Homo sapiens (Human))
BDBM50449057
(CHEMBL3126948)
Show SMILES Cc1ccc(F)cc1C(C)(C)C[C@@](O)(Cc1cc2nnccc2[nH]1)C(F)(F)F |r|
Show InChI InChI=1S/C20H21F4N3O/c1-12-4-5-13(21)8-15(12)18(2,3)11-19(28,20(22,23)24)10-14-9-17-16(26-14)6-7-25-27-17/h4-9,26,28H,10-11H2,1-3H3/t19-/m0/s1
n/an/a 9n/an/an/an/an/an/a
Boehringer Ingelheim Pharmaceuticals
Curated by ChEMBL
Assay Description
Transrepression activity at glucocorticoid receptor in human fibroblasts assessed as inhibition of IL-1-induced IL-6 production after 18 to 24 hrs
J Med Chem 57: 1583-98 (2014)
Article DOI: 10.1021/jm4019178
BindingDB Entry DOI: 10.7270/Q23N24W5
Glucocorticoid receptor
(Homo sapiens (Human))
BDBM50449057
(CHEMBL3126948)
Show SMILES Cc1ccc(F)cc1C(C)(C)C[C@@](O)(Cc1cc2nnccc2[nH]1)C(F)(F)F |r|
Show InChI InChI=1S/C20H21F4N3O/c1-12-4-5-13(21)8-15(12)18(2,3)11-19(28,20(22,23)24)10-14-9-17-16(26-14)6-7-25-27-17/h4-9,26,28H,10-11H2,1-3H3/t19-/m0/s1
n/an/a 5n/an/an/an/an/an/a
Boehringer Ingelheim Pharmaceuticals
Curated by ChEMBL
Assay Description
Competitive binding affinity to glucocorticoid receptor (unknown origin) expressed in baculovirus-infected cell system after 1 hr by fluorescence pol...
J Med Chem 57: 1583-98 (2014)
Article DOI: 10.1021/jm4019178
BindingDB Entry DOI: 10.7270/Q23N24W5