null
SMILES: CC(C)COc1ccc(cc1C#N)-c1nc(N)[nH]c(=O)c1Cl
InChI Key: InChIKey=ZYEAQYVCQUGMBF-UHFFFAOYSA-N
Activity Spreadsheet -- Enzyme Inhibition Constant Data from BindingDB
Found 1 hit for monomerid = 50449111
Trg + Lig
Ki
nM
ΔG°
kcal/mole
IC50
nM
Kd
nM
EC50/IC50
nM
koff
s-1
kon
M-1s-1
pHTemp
°C
Xanthine dehydrogenase/oxidase
(Homo sapiens (Human))
BDBM50449111
(CHEMBL3127131)
Show SMILES CC(C)COc1ccc(cc1C#N)-c1nc(N)[nH]c(=O)c1Cl
Show InChI InChI=1S/C15H15ClN4O2/c1-8(2)7-22-11-4-3-9(5-10(11)6-17)13-12(16)14(21)20-15(18)19-13/h3-5,8H,7H2,1-2H3,(H3,18,19,20,21)
n/an/a 1.60n/an/an/an/an/an/a
AstraZeneca
Curated by ChEMBL
Assay Description
Inhibition of C-terminally FLAG-tagged human xanthine oxidase (amino acid 1 to 1333) expressed in baculovirus system after 15 mins by spectrophotomet...
Bioorg Med Chem Lett 24: 1315-21 (2014)
Article DOI: 10.1016/j.bmcl.2014.01.050
BindingDB Entry DOI: 10.7270/Q2V69M3N