BDBM50449211 CHEMBL3127966
SMILES: Cn1c(CN2CCOCC2)cc2cc(OCCCC3CCN(Cc4ccccc4)CC3)ccc12
InChI Key: InChIKey=GIMCXESHZUNKQO-UHFFFAOYSA-N
Data: 2 IC50
Activity Spreadsheet -- Enzyme Inhibition Constant Data from BindingDB
Found 2 hits for monomerid = 50449211
Trg + Lig
Ki
nM
ΔG°
kcal/mole
IC50
nM
Kd
nM
EC50/IC50
nM
koff
s-1
kon
M-1s-1
pHTemp
°C
Acetylcholinesterase
(Electrophorus electricus (Electric eel))
BDBM50449211
(CHEMBL3127966)
Show SMILES Cn1c(CN2CCOCC2)cc2cc(OCCCC3CCN(Cc4ccccc4)CC3)ccc12
Show InChI InChI=1S/C29H39N3O2/c1-30-27(23-32-15-18-33-19-16-32)20-26-21-28(9-10-29(26)30)34-17-5-8-24-11-13-31(14-12-24)22-25-6-3-2-4-7-25/h2-4,6-7,9-10,20-21,24H,5,8,11-19,22-23H2,1H3
n/an/a 100n/an/an/an/an/an/a
Laboratorio de Qu�mica M�dica (IQOG, CSIC)
Curated by ChEMBL
Assay Description
Inhibition of electric eel AChE using acetylthiocholine iodide as substrate preincubated for 20 mins followed by substrate addition measured after 5 ...
Eur J Med Chem 75: 82-95 (2014)
Article DOI: 10.1016/j.ejmech.2013.12.028
BindingDB Entry DOI: 10.7270/Q22R3T4P
Butyrylcholinesterase (BuChE)
(Equus caballus (Horse))
BDBM50449211
(CHEMBL3127966)
Show SMILES Cn1c(CN2CCOCC2)cc2cc(OCCCC3CCN(Cc4ccccc4)CC3)ccc12
Show InChI InChI=1S/C29H39N3O2/c1-30-27(23-32-15-18-33-19-16-32)20-26-21-28(9-10-29(26)30)34-17-5-8-24-11-13-31(14-12-24)22-25-6-3-2-4-7-25/h2-4,6-7,9-10,20-21,24H,5,8,11-19,22-23H2,1H3
n/an/a 790n/an/an/an/an/an/a
Laboratorio de Qu�mica M�dica (IQOG, CSIC)
Curated by ChEMBL
Assay Description
Inhibition of equine serum BuChE using butyrylthiocholine iodide as substrate preincubated for 20 mins followed by substrate addition measured after ...
Eur J Med Chem 75: 82-95 (2014)
Article DOI: 10.1016/j.ejmech.2013.12.028
BindingDB Entry DOI: 10.7270/Q22R3T4P