BDBM50449377 CHEMBL3126345
SMILES: Fc1cccc(c1Nc1nc2ccncc2c2c1cc[nH]c2=O)C(F)(F)F
InChI Key: InChIKey=ZKARUZSOFAZGMB-UHFFFAOYSA-N
Data: 2 IC50
Activity Spreadsheet -- Enzyme Inhibition Constant Data from BindingDB
Found 2 hits for monomerid = 50449377
Trg + Lig
Ki
nM
ΔG°
kcal/mole
IC50
nM
Kd
nM
EC50/IC50
nM
koff
s-1
kon
M-1s-1
pHTemp
°C
Tyrosine-protein kinase JAK2
(Homo sapiens (Human))
BDBM50449377
(CHEMBL3126345)
Show SMILES Fc1cccc(c1Nc1nc2ccncc2c2c1cc[nH]c2=O)C(F)(F)F
Show InChI InChI=1S/C18H10F4N4O/c19-12-3-1-2-11(18(20,21)22)15(12)26-16-9-4-7-24-17(27)14(9)10-8-23-6-5-13(10)25-16/h1-8H,(H,24,27)(H,25,26)
Reactome pathway
n/an/a 9n/an/an/an/an/an/a
Merck& Co.
Curated by ChEMBL
Assay Description
Inhibition of recombinant Jak2 (unknown origin) using biotinylated synthetic peptide substrate by homogeneous time resolved fluorescence assay
Bioorg Med Chem Lett 24: 1466-71 (2014)
Article DOI: 10.1016/j.bmcl.2014.02.011
BindingDB Entry DOI: 10.7270/Q2D22034
Tyrosine-protein kinase JAK2
(Homo sapiens (Human))
BDBM50449377
(CHEMBL3126345)
Show SMILES Fc1cccc(c1Nc1nc2ccncc2c2c1cc[nH]c2=O)C(F)(F)F
Show InChI InChI=1S/C18H10F4N4O/c19-12-3-1-2-11(18(20,21)22)15(12)26-16-9-4-7-24-17(27)14(9)10-8-23-6-5-13(10)25-16/h1-8H,(H,24,27)(H,25,26)
Reactome pathway
n/an/a 90n/an/an/an/an/an/a
Merck& Co.
Curated by ChEMBL
Assay Description
Inhibition of Jak2 (unknown origin) assessed as inhibition of STAT5 phosphorylation by cell-based assay
Bioorg Med Chem Lett 24: 1466-71 (2014)
Article DOI: 10.1016/j.bmcl.2014.02.011
BindingDB Entry DOI: 10.7270/Q2D22034