BDBM50450396 CHEMBL102912
SMILES: CCCCCCCC[C@@H](SCCCCCC)C(=O)Nc1c(SC)cc[n+](C)c1SC
InChI Key: InChIKey=JBWAGZKZUMOLQZ-OAQYLSRUSA-O
Data: 1 IC50
Activity Spreadsheet -- Enzyme Inhibition Constant Data from BindingDB
Found 1 hit for monomerid = 50450396
Trg + Lig
Ki
nM
ΔG°
kcal/mole
IC50
nM
Kd
nM
EC50/IC50
nM
koff
s-1
kon
M-1s-1
pHTemp
°C
Sterol O-acyltransferase, Soat
(Rattus norvegicus)
BDBM50450396
(CHEMBL102912)
Show SMILES CCCCCCCC[C@@H](SCCCCCC)C(=O)Nc1c(SC)cc[n+](C)c1SC
Show InChI InChI=1S/C24H42N2OS3/c1-6-8-10-12-13-14-16-21(30-19-15-11-9-7-2)23(27)25-22-20(28-4)17-18-26(3)24(22)29-5/h17-18,21H,6-16,19H2,1-5H3/p+1/t21-/m1/s1
n/an/a 22n/an/an/an/an/an/a
Warner-Lambert Company
Curated by ChEMBL
Assay Description
Concentration required for the in vitro inhibition of Acyl coenzyme A:cholesterol acyltransferase (ACAT) in liver microsomes isolated from cholestero...
Bioorg Med Chem Lett 5: 295-300 (1995)
BindingDB Entry DOI: 10.7270/Q29Z94WS