BDBM50451308 CHEMBL2370657
SMILES: [H][C@@]12C[C@@H](O)CN1C(=O)[C@@H](NC(=O)[C@H](Cc1ccc(O)cc1)NC(=O)[C@@H](C)NC(=O)[C@@]([H])(NC(=O)C[C@@H](CCCCCCCCCCCCC)OC(=O)[C@H](CCN)NC(=O)[C@@]([H])(NC(=O)CNC(=O)[C@@]([H])(NC(=O)[C@]1([H])[C@@H](O)CCN1C(=O)[C@@]([H])(NC(=O)[C@@]([H])(NC2=O)[C@@H](C)O)[C@@H](C)O)[C@H](O)CC#N)[C@@H](C)O)[C@@H](C)O)C(C)C
InChI Key: InChIKey=SUJQVWZQHMKCKA-FCYCPIGYSA-N
Data: 1 IC50
Activity Spreadsheet -- Enzyme Inhibition Constant Data from BindingDB
Found 1 hit for monomerid = 50451308
Trg + Lig
Ki
nM
ΔG°
kcal/mole
IC50
nM
Kd
nM
EC50/IC50
nM
koff
s-1
kon
M-1s-1
pHTemp
°C
Glucan Synthase
(Candida albicans (Yeast))
BDBM50451308
(CHEMBL2370657)
Show SMILES [H][C@@]12C[C@@H](O)CN1C(=O)[C@@H](NC(=O)[C@H](Cc1ccc(O)cc1)NC(=O)[C@@H](C)NC(=O)[C@@]([H])(NC(=O)C[C@@H](CCCCCCCCCCCCC)OC(=O)[C@H](CCN)NC(=O)[C@@]([H])(NC(=O)CNC(=O)[C@@]([H])(NC(=O)[C@]1([H])[C@@H](O)CCN1C(=O)[C@@]([H])(NC(=O)[C@@]([H])(NC2=O)[C@@H](C)O)[C@@H](C)O)[C@H](O)CC#N)[C@@H](C)O)[C@@H](C)O)C(C)C
Show InChI InChI=1S/C70H112N14O22/c1-9-10-11-12-13-14-15-16-17-18-19-20-45-33-51(93)77-54(38(5)85)64(99)74-37(4)60(95)76-47(31-42-21-23-43(89)24-22-42)61(96)79-53(36(2)3)68(103)84-35-44(90)32-48(84)62(97)80-56(40(7)87)66(101)81-57(41(8)88)69(104)83-30-27-50(92)59(83)67(102)82-58(49(91)26-29-72)63(98)73-34-52(94)78-55(39(6)86)65(100)75-46(25-28-71)70(105)106-45/h21-24,36-41,44-50,53-59,85-92H,9-20,25-28,30-35,71H2,1-8H3,(H,73,98)(H,74,99)(H,75,100)(H,76,95)(H,77,93)(H,78,94)(H,79,96)(H,80,97)(H,81,101)(H,82,102)/t37-,38-,39-,40-,41-,44-,45-,46+,47+,48+,49-,50+,53+,54+,55+,56+,57+,58+,59+/m1/s1
n/an/a 19n/an/an/an/an/an/a
Nippon Roche Research Center
Curated by ChEMBL
Assay Description
Inhibition of 1,3-beta-D-glucan synthase (GS) from candida albicans
Bioorg Med Chem Lett 11: 395-8 (2001)
BindingDB Entry DOI: 10.7270/Q28051W2