null
SMILES: O=C(OCC1CCCN(CCCc2ccccc2)C1)c1ccccc1N1C(=O)CC(C2CCCC2)C1=O
InChI Key: InChIKey=KKFBTFCVHZOBSO-UHFFFAOYSA-N
Activity Spreadsheet -- Enzyme Inhibition Constant Data from BindingDB
Found 1 hit for monomerid = 50451971
Trg + Lig
Ki
nM
ΔG°
kcal/mole
IC50
nM
Kd
nM
EC50/IC50
nM
koff
s-1
kon
M-1s-1
pHTemp
°C
Neuronal acetylcholine receptor subunit alpha-3/beta-4
(Homo sapiens (Human))
BDBM50451971
(CHEMBL330867)
Show SMILES O=C(OCC1CCCN(CCCc2ccccc2)C1)c1ccccc1N1C(=O)CC(C2CCCC2)C1=O
Show InChI InChI=1S/C31H38N2O4/c34-29-20-27(25-14-4-5-15-25)30(35)33(29)28-17-7-6-16-26(28)31(36)37-22-24-13-9-19-32(21-24)18-8-12-23-10-2-1-3-11-23/h1-3,6-7,10-11,16-17,24-25,27H,4-5,8-9,12-15,18-22H2
n/an/a 1.20E+3n/an/an/an/an/an/a
Ohio University
Curated by ChEMBL
Assay Description
Effect on alpha3-beta4 neuronal nicotinic acetylcholine receptor-stimulated adrenal catecholamine secretion
Bioorg Med Chem Lett 14: 3739-42 (2004)
Article DOI: 10.1016/j.bmcl.2004.05.001
BindingDB Entry DOI: 10.7270/Q28G8M80