BDBM50452573 CHEMBL3038260
SMILES: [H][C@]12CCC(C1)[C@]([H])(C2)Nc1ncnc2n(cnc12)[C@@H]1O[C@H](CCl)[C@@H](O)[C@H]1O
InChI Key: InChIKey=PVJGDYDNVNCGBT-QCWQUIKUSA-N
Data: 2 KI
Activity Spreadsheet -- Enzyme Inhibition Constant Data from BindingDB
Found 2 hits for monomerid = 50452573
Trg + Lig
Ki
nM
ΔG°
kcal/mole
IC50
nM
Kd
nM
EC50/IC50
nM
koff
s-1
kon
M-1s-1
pHTemp
°C
Adenosine receptor A1
(Rattus norvegicus (rat))
BDBM50452573
(CHEMBL3038260)
Show SMILES [H][C@]12CCC(C1)[C@]([H])(C2)Nc1ncnc2n(cnc12)[C@@H]1O[C@H](CCl)[C@@H](O)[C@H]1O |r,THB:9:6:5:3.2|
Show InChI InChI=1S/C17H22ClN5O3/c18-5-11-13(24)14(25)17(26-11)23-7-21-12-15(19-6-20-16(12)23)22-10-4-8-1-2-9(10)3-8/h6-11,13-14,17,24-25H,1-5H2,(H,19,20,22)/t8-,9?,10-,11+,13+,14+,17+/m0/s1
Reactome pathway
0.240n/an/an/an/an/an/an/an/a
Warner-Lambert Company
Curated by ChEMBL
Assay Description
Binding affinity against Adenosine A1 receptor using [3H]CHA in rat brain membranes
J Med Chem 32: 8-11 (1989)
BindingDB Entry DOI: 10.7270/Q2TX3FZF
Adenosine A2 receptor
(Rattus norvegicus-Rattus norvegicus (rat))
BDBM50452573
(CHEMBL3038260)
Show SMILES [H][C@]12CCC(C1)[C@]([H])(C2)Nc1ncnc2n(cnc12)[C@@H]1O[C@H](CCl)[C@@H](O)[C@H]1O |r,THB:9:6:5:3.2|
Show InChI InChI=1S/C17H22ClN5O3/c18-5-11-13(24)14(25)17(26-11)23-7-21-12-15(19-6-20-16(12)23)22-10-4-8-1-2-9(10)3-8/h6-11,13-14,17,24-25H,1-5H2,(H,19,20,22)/t8-,9?,10-,11+,13+,14+,17+/m0/s1
3.90E+3n/an/an/an/an/an/an/an/a
Warner-Lambert Company
Curated by ChEMBL
Assay Description
Binding affinity against Adenosine A2 receptor using [3H]NECA with 50 nM CPA in rat striatal brain membranes
J Med Chem 32: 8-11 (1989)
BindingDB Entry DOI: 10.7270/Q2TX3FZF