BDBM50453793 CHEMBL2113559
SMILES: COc1cc(\C=C\C=N\Nc2nc(N)c3ncn([C@@H]4O[C@H](CO)[C@@H](O)[C@H]4O)c3n2)ccc1O
InChI Key: InChIKey=GUWMTHIBQGCCPK-MUKMMEJISA-N
Data: 2 KI  2 EC50
Activity Spreadsheet -- Enzyme Inhibition Constant Data from BindingDB
Found 4 hits for monomerid = 50453793
Trg + Lig
Ki
nM
ΔG°
kcal/mole
IC50
nM
Kd
nM
EC50/IC50
nM
koff
s-1
kon
M-1s-1
pHTemp
°C
Adenosine Receptors A2a (A2a)
(Rattus norvegicus (rat))
BDBM50453793
(CHEMBL2113559)
Show SMILES COc1cc(\C=C\C=N\Nc2nc(N)c3ncn([C@@H]4O[C@H](CO)[C@@H](O)[C@H]4O)c3n2)ccc1O |r|
Show InChI InChI=1S/C20H23N7O6/c1-32-12-7-10(4-5-11(12)29)3-2-6-23-26-20-24-17(21)14-18(25-20)27(9-22-14)19-16(31)15(30)13(8-28)33-19/h2-7,9,13,15-16,19,28-31H,8H2,1H3,(H3,21,24,25,26)/b3-2+,23-6+/t13-,15-,16-,19-/m1/s1
Reactome pathway
27n/an/an/an/an/an/an/an/a
Universit£ di Milano
Curated by ChEMBL
Assay Description
Displacement of [3H]-CGS- 21680 from Adenosine A2A receptor of rat striatum
J Med Chem 38: 3581-5 (1995)
BindingDB Entry DOI: 10.7270/Q29C6Z2Z
Adenosine receptor A1
(Rattus norvegicus (rat))
BDBM50453793
(CHEMBL2113559)
Show SMILES COc1cc(\C=C\C=N\Nc2nc(N)c3ncn([C@@H]4O[C@H](CO)[C@@H](O)[C@H]4O)c3n2)ccc1O |r|
Show InChI InChI=1S/C20H23N7O6/c1-32-12-7-10(4-5-11(12)29)3-2-6-23-26-20-24-17(21)14-18(25-20)27(9-22-14)19-16(31)15(30)13(8-28)33-19/h2-7,9,13,15-16,19,28-31H,8H2,1H3,(H3,21,24,25,26)/b3-2+,23-6+/t13-,15-,16-,19-/m1/s1
Reactome pathway
545n/an/an/an/an/an/an/an/a
Universit£ di Milano
Curated by ChEMBL
Assay Description
Displacement of [3H]CHA from Adenosine A1 receptor of rat brain
J Med Chem 38: 3581-5 (1995)
BindingDB Entry DOI: 10.7270/Q29C6Z2Z
Adenosine Receptors A2a (A2a)
(Rattus norvegicus (rat))
BDBM50453793
(CHEMBL2113559)
Show SMILES COc1cc(\C=C\C=N\Nc2nc(N)c3ncn([C@@H]4O[C@H](CO)[C@@H](O)[C@H]4O)c3n2)ccc1O |r|
Show InChI InChI=1S/C20H23N7O6/c1-32-12-7-10(4-5-11(12)29)3-2-6-23-26-20-24-17(21)14-18(25-20)27(9-22-14)19-16(31)15(30)13(8-28)33-19/h2-7,9,13,15-16,19,28-31H,8H2,1H3,(H3,21,24,25,26)/b3-2+,23-6+/t13-,15-,16-,19-/m1/s1
Reactome pathway
n/an/an/an/a 281n/an/an/an/a
Universit£ di Milano
Curated by ChEMBL
Assay Description
Functional activity at Adenosine A2A receptor as vasorelaation of rat aorta
J Med Chem 38: 3581-5 (1995)
BindingDB Entry DOI: 10.7270/Q29C6Z2Z
Adenosine receptor A1
(Rattus norvegicus (rat))
BDBM50453793
(CHEMBL2113559)
Show SMILES COc1cc(\C=C\C=N\Nc2nc(N)c3ncn([C@@H]4O[C@H](CO)[C@@H](O)[C@H]4O)c3n2)ccc1O |r|
Show InChI InChI=1S/C20H23N7O6/c1-32-12-7-10(4-5-11(12)29)3-2-6-23-26-20-24-17(21)14-18(25-20)27(9-22-14)19-16(31)15(30)13(8-28)33-19/h2-7,9,13,15-16,19,28-31H,8H2,1H3,(H3,21,24,25,26)/b3-2+,23-6+/t13-,15-,16-,19-/m1/s1
Reactome pathway
n/an/an/an/a 4.89E+3n/an/an/an/a
Universit£ di Milano
Curated by ChEMBL
Assay Description
Activitty at Adenosine A1 receptor of rat atria
J Med Chem 38: 3581-5 (1995)
BindingDB Entry DOI: 10.7270/Q29C6Z2Z