BDBM50454900 CHEMBL2113470
SMILES: CNC[C@H]1O[C@H]([C@H](O)[C@@H]1O)n1cnc2c(NC3CCCC3)ncnc12
InChI Key: InChIKey=QCLSNNMFXOWOIM-XNIJJKJLSA-N
Data: 3 KI  1 EC50
Activity Spreadsheet -- Enzyme Inhibition Constant Data from BindingDB
Found 4 hits for monomerid = 50454900
Trg + Lig
Ki
nM
ΔG°
kcal/mole
IC50
nM
Kd
nM
EC50/IC50
nM
koff
s-1
kon
M-1s-1
pHTemp
°C
Adenosine receptor A1
(Rattus norvegicus (rat))
BDBM50454900
(CHEMBL2113470)
Show SMILES CNC[C@H]1O[C@H]([C@H](O)[C@@H]1O)n1cnc2c(NC3CCCC3)ncnc12 |r|
Show InChI InChI=1S/C16H24N6O3/c1-17-6-10-12(23)13(24)16(25-10)22-8-20-11-14(18-7-19-15(11)22)21-9-4-2-3-5-9/h7-10,12-13,16-17,23-24H,2-6H2,1H3,(H,18,19,21)/t10-,12-,13-,16-/m1/s1
Reactome pathway
440n/an/an/an/an/an/an/an/a
Leiden/Amsterdam Center for Drug Research
Curated by ChEMBL
Assay Description
Binding affinity against adenosine A1 receptor using [3H]DPCPX in rat cortical membranes in the absence of GTP
J Med Chem 41: 102-8 (1998)
Article DOI: 10.1021/jm970508l
BindingDB Entry DOI: 10.7270/Q2MK6DKX
Adenosine receptor A1
(Rattus norvegicus (rat))
BDBM50454900
(CHEMBL2113470)
Show SMILES CNC[C@H]1O[C@H]([C@H](O)[C@@H]1O)n1cnc2c(NC3CCCC3)ncnc12 |r|
Show InChI InChI=1S/C16H24N6O3/c1-17-6-10-12(23)13(24)16(25-10)22-8-20-11-14(18-7-19-15(11)22)21-9-4-2-3-5-9/h7-10,12-13,16-17,23-24H,2-6H2,1H3,(H,18,19,21)/t10-,12-,13-,16-/m1/s1
Reactome pathway
2.60E+3n/an/an/an/an/an/an/an/a
Leiden/Amsterdam Center for Drug Research
Curated by ChEMBL
Assay Description
Binding affinity against adenosine A1 receptor using [3H]DPCPX in rat cortical membranes in the presence of GTP.
J Med Chem 41: 102-8 (1998)
Article DOI: 10.1021/jm970508l
BindingDB Entry DOI: 10.7270/Q2MK6DKX
Adenosine Receptors A2a (A2a)
(Rattus norvegicus (rat))
BDBM50454900
(CHEMBL2113470)
Show SMILES CNC[C@H]1O[C@H]([C@H](O)[C@@H]1O)n1cnc2c(NC3CCCC3)ncnc12 |r|
Show InChI InChI=1S/C16H24N6O3/c1-17-6-10-12(23)13(24)16(25-10)22-8-20-11-14(18-7-19-15(11)22)21-9-4-2-3-5-9/h7-10,12-13,16-17,23-24H,2-6H2,1H3,(H,18,19,21)/t10-,12-,13-,16-/m1/s1
Reactome pathway
4.55E+4n/an/an/an/an/an/an/an/a
Leiden/Amsterdam Center for Drug Research
Curated by ChEMBL
Assay Description
Binding affinity against Adenosine A2A receptor using [3H]-CGS- 21680 as the radioligand in rat striatal membranes
J Med Chem 41: 102-8 (1998)
Article DOI: 10.1021/jm970508l
BindingDB Entry DOI: 10.7270/Q2MK6DKX
Adenosine receptor A1
(Rattus norvegicus (rat))
BDBM50454900
(CHEMBL2113470)
Show SMILES CNC[C@H]1O[C@H]([C@H](O)[C@@H]1O)n1cnc2c(NC3CCCC3)ncnc12 |r|
Show InChI InChI=1S/C16H24N6O3/c1-17-6-10-12(23)13(24)16(25-10)22-8-20-11-14(18-7-19-15(11)22)21-9-4-2-3-5-9/h7-10,12-13,16-17,23-24H,2-6H2,1H3,(H,18,19,21)/t10-,12-,13-,16-/m1/s1
Reactome pathway
n/an/an/an/a 1.33E+3n/an/an/an/a
Leiden/Amsterdam Center for Drug Research
Curated by ChEMBL
Assay Description
Effective concentration for [35S]GTP-gamma-S, binding to adenosine A1 receptor in rat brain membranes
J Med Chem 41: 102-8 (1998)
Article DOI: 10.1021/jm970508l
BindingDB Entry DOI: 10.7270/Q2MK6DKX