BDBM50455 MLS000409278::N-[4-[2-[3-(dimethylsulfamoyl)anilino]-6H-1,3,4-thiadiazin-5-yl]phenyl]acetamide::N-[4-[2-[[3-(dimethylsulfamoyl)phenyl]amino]-6H-1,3,4-thiadiazin-5-yl]phenyl]ethanamide::SMR000243653::cid_4878046
SMILES: CN(C)S(=O)(=O)c1cccc(NC2=NN=C(CS2)c2ccc(NC(C)=O)cc2)c1
InChI Key: InChIKey=FRWUUIXIPUZZSW-UHFFFAOYSA-N
Data: 2 IC50
Activity Spreadsheet -- Enzyme Inhibition Constant Data from BindingDB
Found 2 hits for monomerid = 50455
Trg + Lig
Ki
nM
ΔG°
kcal/mole
IC50
nM
Kd
nM
EC50/IC50
nM
koff
s-1
kon
M-1s-1
pHTemp
°C
Voltage-gated calcium channel subunit alpha Cav2.2
(Homo sapiens (Human))
BDBM50455
(MLS000409278 | N-[4-[2-[3-(dimethylsulfamoyl)anili...)
Show SMILES CN(C)S(=O)(=O)c1cccc(NC2=NN=C(CS2)c2ccc(NC(C)=O)cc2)c1 |c:14,t:12|
Show InChI InChI=1S/C19H21N5O3S2/c1-13(25)20-15-9-7-14(8-10-15)18-12-28-19(23-22-18)21-16-5-4-6-17(11-16)29(26,27)24(2)3/h4-11H,12H2,1-3H3,(H,20,25)(H,21,23)
PCBioAssay
n/an/a 3.56E+3n/an/an/an/an/an/a
Burnham Center for Chemical Genomics
Curated by PubChem BioAssay
Assay Description
Data Source: Data Source: Sanford-Burnham Center for Chemical Genomics (SBCCG) Source Affiliation: Sanford-Burnham Medical Research Institute Network...
PubChem Bioassay (2009)
BindingDB Entry DOI: 10.7270/Q2PZ578V
Induced myeloid leukemia cell differentiation protein Mcl-1
(Homo sapiens (Human))
BDBM50455
(MLS000409278 | N-[4-[2-[3-(dimethylsulfamoyl)anili...)
Show SMILES CN(C)S(=O)(=O)c1cccc(NC2=NN=C(CS2)c2ccc(NC(C)=O)cc2)c1 |c:14,t:12|
Show InChI InChI=1S/C19H21N5O3S2/c1-13(25)20-15-9-7-14(8-10-15)18-12-28-19(23-22-18)21-16-5-4-6-17(11-16)29(26,27)24(2)3/h4-11H,12H2,1-3H3,(H,20,25)(H,21,23)
NCI pathway
PCBioAssay
n/an/a 4.20E+3n/an/an/an/an/an/a
Emory University Molecular Libraries Screening Center
Curated by PubChem BioAssay
Assay Description
NIH Molecular Libraries Screening Centers Network [MLSCN] Emory Chemical Biology Discovery Center in MLSCN Assay provider: Nikolovska-Coleska, Univer...
PubChem Bioassay (2008)
BindingDB Entry DOI: 10.7270/Q23X8539