BDBM5047 N-(5-tert-Butyl-3,4-dimethyl-1,3-thiazol-2(3H)-ylidene)-5-chloro-2-cyanobenzenesulfonamide::N-[(2Z)-5-tert-butyl-3,4-dimethyl-2,3-dihydro-1,3-thiazol-2-ylidene]-5-chloro-2-cyanobenzene-1-sulfonamide::thiazolidenebenzenesulfonamide deriv. 18a
SMILES: Cc1c(s\c(=N/S(=O)(=O)c2cc(Cl)ccc2C#N)n1C)C(C)(C)C
InChI Key: InChIKey=JUDJXEWXQVMSAD-CYVLTUHYSA-N
Data: 3 IC50
Activity Spreadsheet -- Enzyme Inhibition Constant Data from BindingDB
Found 3 hits for monomerid = 5047
Trg + Lig
Ki
nM
ΔG°
kcal/mole
IC50
nM
Kd
nM
EC50/IC50
nM
koff
s-1
kon
M-1s-1
pHTemp
°C
HIV-1 Reverse Transcriptase
(Human immunodeficiency virus type 1)
BDBM5047
(N-(5-tert-Butyl-3,4-dimethyl-1,3-thiazol-2(3H)-yli...)
Show SMILES Cc1c(s\c(=N/S(=O)(=O)c2cc(Cl)ccc2C#N)n1C)C(C)(C)C
Show InChI InChI=1S/C16H18ClN3O2S2/c1-10-14(16(2,3)4)23-15(20(10)5)19-24(21,22)13-8-12(17)7-6-11(13)9-18/h6-8H,1-5H3/b19-15-
n/an/a 180n/an/an/an/an/an/a
Yamanouchi Pharmaceutical Co. Ltd
Assay Description
The IC50 of reverse transcriptase is the concentration that inhibits 50% of recombinant HIV-1 RT RNA-directed DNA polymerase activity in vitro.
Bioorg Med Chem 13: 949-61 (2005)
Article DOI: 10.1016/j.bmc.2004.11.045
BindingDB Entry DOI: 10.7270/Q2C53J1Z
HIV-1 Reverse Transcriptase Mutant (Y181C)
(Human immunodeficiency virus type 1)
BDBM5047
(N-(5-tert-Butyl-3,4-dimethyl-1,3-thiazol-2(3H)-yli...)
Show SMILES Cc1c(s\c(=N/S(=O)(=O)c2cc(Cl)ccc2C#N)n1C)C(C)(C)C
Show InChI InChI=1S/C16H18ClN3O2S2/c1-10-14(16(2,3)4)23-15(20(10)5)19-24(21,22)13-8-12(17)7-6-11(13)9-18/h6-8H,1-5H3/b19-15-
n/an/a 69n/an/an/an/an/an/a
Yamanouchi Pharmaceutical Co. Ltd
Assay Description
The IC50 of reverse transcriptase is the concentration that inhibits 50% of recombinant HIV-1 RT RNA-directed DNA polymerase activity in vitro.
Bioorg Med Chem 13: 949-61 (2005)
Article DOI: 10.1016/j.bmc.2004.11.045
BindingDB Entry DOI: 10.7270/Q2C53J1Z
HIV-1 Reverse Transcriptase Mutant (K103N)
(Human immunodeficiency virus type 1)
BDBM5047
(N-(5-tert-Butyl-3,4-dimethyl-1,3-thiazol-2(3H)-yli...)
Show SMILES Cc1c(s\c(=N/S(=O)(=O)c2cc(Cl)ccc2C#N)n1C)C(C)(C)C
Show InChI InChI=1S/C16H18ClN3O2S2/c1-10-14(16(2,3)4)23-15(20(10)5)19-24(21,22)13-8-12(17)7-6-11(13)9-18/h6-8H,1-5H3/b19-15-
n/an/a>5.00E+4n/an/an/an/an/an/a
Yamanouchi Pharmaceutical Co. Ltd
Assay Description
The IC50 of reverse transcriptase is the concentration that inhibits 50% of recombinant HIV-1 RT RNA-directed DNA polymerase activity in vitro.
Bioorg Med Chem 13: 949-61 (2005)
Article DOI: 10.1016/j.bmc.2004.11.045
BindingDB Entry DOI: 10.7270/Q2C53J1Z