BDBM5051 5-Chloro-N-(4-chloro-5-isopropyl-3-methyl-13-thiazol-2(3H)-ylidene)-2-hydroxybenzenesulfonamide::5-chloro-N-[(2Z)-4-chloro-3-methyl-5-(propan-2-yl)-2,3-dihydro-1,3-thiazol-2-ylidene]-2-hydroxybenzene-1-sulfonamide::thiazolidenebenzenesulfonamide deriv. 11f
SMILES: CC(C)c1s\c(=N/S(=O)(=O)c2cc(Cl)ccc2O)n(C)c1Cl
InChI Key: InChIKey=VTKAGCUSZSWYBW-SSZFMOIBSA-N
Data: 4 IC50
Activity Spreadsheet -- Enzyme Inhibition Constant Data from BindingDB
Found 4 hits for monomerid = 5051
Trg + Lig
Ki
nM
ΔG°
kcal/mole
IC50
nM
Kd
nM
EC50/IC50
nM
koff
s-1
kon
M-1s-1
pHTemp
°C
HIV-1 Reverse Transcriptase
(Human immunodeficiency virus type 1)
BDBM5051
(5-Chloro-N-(4-chloro-5-isopropyl-3-methyl-13-thiaz...)
Show SMILES CC(C)c1s\c(=N/S(=O)(=O)c2cc(Cl)ccc2O)n(C)c1Cl
Show InChI InChI=1S/C13H14Cl2N2O3S2/c1-7(2)11-12(15)17(3)13(21-11)16-22(19,20)10-6-8(14)4-5-9(10)18/h4-7,18H,1-3H3/b16-13-
n/an/a 9.40n/an/an/an/an/an/a
Yamanouchi Pharmaceutical Co. Ltd
Assay Description
The IC50 of reverse transcriptase is the concentration that inhibits 50% of recombinant HIV-1 RT RNA-directed DNA polymerase activity in vitro.
Bioorg Med Chem 13: 949-61 (2005)
Article DOI: 10.1016/j.bmc.2004.11.045
BindingDB Entry DOI: 10.7270/Q2C53J1Z
Reverse Transcriptase
(Human immunodeficiency virus 1)
BDBM5051
(5-Chloro-N-(4-chloro-5-isopropyl-3-methyl-13-thiaz...)
Show SMILES CC(C)c1s\c(=N/S(=O)(=O)c2cc(Cl)ccc2O)n(C)c1Cl
Show InChI InChI=1S/C13H14Cl2N2O3S2/c1-7(2)11-12(15)17(3)13(21-11)16-22(19,20)10-6-8(14)4-5-9(10)18/h4-7,18H,1-3H3/b16-13-
n/an/a 158n/an/an/an/an/an/a
Korea Institute of Science and Technology
Curated by ChEMBL
Assay Description
Inhibition of HIV1 reverse transcriptase K103N mutant by HeLa-MAGI assay
Bioorg Med Chem Lett 18: 1181-94 (2008)
Article DOI: 10.1016/j.bmcl.2007.11.134
BindingDB Entry DOI: 10.7270/Q2NS0XPK
HIV-1 Reverse Transcriptase Mutant (Y181C)
(Human immunodeficiency virus type 1)
BDBM5051
(5-Chloro-N-(4-chloro-5-isopropyl-3-methyl-13-thiaz...)
Show SMILES CC(C)c1s\c(=N/S(=O)(=O)c2cc(Cl)ccc2O)n(C)c1Cl
Show InChI InChI=1S/C13H14Cl2N2O3S2/c1-7(2)11-12(15)17(3)13(21-11)16-22(19,20)10-6-8(14)4-5-9(10)18/h4-7,18H,1-3H3/b16-13-
n/an/a 21n/an/an/an/an/an/a
Yamanouchi Pharmaceutical Co. Ltd
Assay Description
The IC50 of reverse transcriptase is the concentration that inhibits 50% of recombinant HIV-1 RT RNA-directed DNA polymerase activity in vitro.
Bioorg Med Chem 13: 949-61 (2005)
Article DOI: 10.1016/j.bmc.2004.11.045
BindingDB Entry DOI: 10.7270/Q2C53J1Z
HIV-1 Reverse Transcriptase Mutant (K103N)
(Human immunodeficiency virus type 1)
BDBM5051
(5-Chloro-N-(4-chloro-5-isopropyl-3-methyl-13-thiaz...)
Show SMILES CC(C)c1s\c(=N/S(=O)(=O)c2cc(Cl)ccc2O)n(C)c1Cl
Show InChI InChI=1S/C13H14Cl2N2O3S2/c1-7(2)11-12(15)17(3)13(21-11)16-22(19,20)10-6-8(14)4-5-9(10)18/h4-7,18H,1-3H3/b16-13-
n/an/a 170n/an/an/an/an/an/a
Yamanouchi Pharmaceutical Co. Ltd
Assay Description
The IC50 of reverse transcriptase is the concentration that inhibits 50% of recombinant HIV-1 RT RNA-directed DNA polymerase activity in vitro.
Bioorg Med Chem 13: 949-61 (2005)
Article DOI: 10.1016/j.bmc.2004.11.045
BindingDB Entry DOI: 10.7270/Q2C53J1Z