BDBM50892 1-[2,3-bis(2-furanyl)-6-quinoxalinyl]-3-[4-(4-morpholinyl)phenyl]thiourea::1-[2,3-bis(2-furyl)quinoxalin-6-yl]-3-(4-morpholinophenyl)thiourea::1-[2,3-bis(furan-2-yl)quinoxalin-6-yl]-3-(4-morpholin-4-ylphenyl)thiourea::MLS000534759::N-(2,3-di-2-furyl-6-quinoxalinyl)-N'-[4-(4-morpholinyl)phenyl]thiourea::SMR000142215::cid_1331358
SMILES: S=C(Nc1ccc(cc1)N1CCOCC1)Nc1ccc2nc(-c3ccco3)c(nc2c1)-c1ccco1
InChI Key: InChIKey=KBQUGQKOZBTLIO-UHFFFAOYSA-N
Data: 3 IC50  1 EC50
Activity Spreadsheet -- Enzyme Inhibition Constant Data from BindingDB
Found 4 hits for monomerid = 50892
Trg + Lig
Ki
nM
ΔG°
kcal/mole
IC50
nM
Kd
nM
EC50/IC50
nM
koff
s-1
kon
M-1s-1
pHTemp
°C
BZLF2
(Human herpesvirus 4 type 2)
BDBM50892
(1-[2,3-bis(2-furanyl)-6-quinoxalinyl]-3-[4-(4-morp...)
Show SMILES S=C(Nc1ccc(cc1)N1CCOCC1)Nc1ccc2nc(-c3ccco3)c(nc2c1)-c1ccco1
Show InChI InChI=1S/C27H23N5O3S/c36-27(28-18-5-8-20(9-6-18)32-11-15-33-16-12-32)29-19-7-10-21-22(17-19)31-26(24-4-2-14-35-24)25(30-21)23-3-1-13-34-23/h1-10,13-14,17H,11-12,15-16H2,(H2,28,29,36)
PCBioAssay
n/an/a 6.33E+3n/an/an/an/an/an/a
Emory University Molecular Libraries Screening Center
Curated by PubChem BioAssay
Assay Description
NIH Molecular Libraries Screening Centers Network [MLSCN] Emory Chemical Biology Discovery Center in MLSCN Assay provider: Theodore Jardetzky; Northw...
PubChem Bioassay (2008)
BindingDB Entry DOI: 10.7270/Q2057DCW
lens epithelium-derived growth factor p75
(Homo sapiens (Human))
BDBM50892
(1-[2,3-bis(2-furanyl)-6-quinoxalinyl]-3-[4-(4-morp...)
Show SMILES S=C(Nc1ccc(cc1)N1CCOCC1)Nc1ccc2nc(-c3ccco3)c(nc2c1)-c1ccco1
Show InChI InChI=1S/C27H23N5O3S/c36-27(28-18-5-8-20(9-6-18)32-11-15-33-16-12-32)29-19-7-10-21-22(17-19)31-26(24-4-2-14-35-24)25(30-21)23-3-1-13-34-23/h1-10,13-14,17H,11-12,15-16H2,(H2,28,29,36)
Reactome pathway
PCBioAssay
n/an/a 3.65E+4n/an/an/an/an/an/a
The Scripps Research Institute Molecular Screening Center
Curated by PubChem BioAssay
Assay Description
Source (MLPCN Center Name): The Scripps Research Institute Molecular Screening Center (SRIMSC) Affiliation: Ohio State University Assay Provider: Mam...
PubChem Bioassay (2014)
BindingDB Entry DOI: 10.7270/Q2KD1WKS
lens epithelium-derived growth factor p75
(Homo sapiens (Human))
BDBM50892
(1-[2,3-bis(2-furanyl)-6-quinoxalinyl]-3-[4-(4-morp...)
Show SMILES S=C(Nc1ccc(cc1)N1CCOCC1)Nc1ccc2nc(-c3ccco3)c(nc2c1)-c1ccco1
Show InChI InChI=1S/C27H23N5O3S/c36-27(28-18-5-8-20(9-6-18)32-11-15-33-16-12-32)29-19-7-10-21-22(17-19)31-26(24-4-2-14-35-24)25(30-21)23-3-1-13-34-23/h1-10,13-14,17H,11-12,15-16H2,(H2,28,29,36)
Reactome pathway
PCBioAssay
n/an/a 5.37E+4n/an/an/an/an/an/a
The Scripps Research Institute Molecular Screening Center
Curated by PubChem BioAssay
Assay Description
Source (MLPCN Center Name): The Scripps Research Institute Molecular Screening Center (SRIMSC) Affiliation: Ohio State University Assay Provider: Mam...
PubChem Bioassay (2014)
BindingDB Entry DOI: 10.7270/Q2Q52N9H
cardiac alpha tropomyosin
(Sus scrofa)
BDBM50892
(1-[2,3-bis(2-furanyl)-6-quinoxalinyl]-3-[4-(4-morp...)
Show SMILES S=C(Nc1ccc(cc1)N1CCOCC1)Nc1ccc2nc(-c3ccco3)c(nc2c1)-c1ccco1
Show InChI InChI=1S/C27H23N5O3S/c36-27(28-18-5-8-20(9-6-18)32-11-15-33-16-12-32)29-19-7-10-21-22(17-19)31-26(24-4-2-14-35-24)25(30-21)23-3-1-13-34-23/h1-10,13-14,17H,11-12,15-16H2,(H2,28,29,36)
PCBioAssay
n/an/an/an/a 2.92E+3n/an/an/an/a
The Scripps Research Institute Molecular Screening Center
Curated by PubChem BioAssay
Assay Description
Source (MLPCN Center Name): The Scripps Research Institute Molecular Screening Center (SRIMSC) Affiliation: The Scripps Research Institute, TSRI Assa...
PubChem Bioassay (2011)
BindingDB Entry DOI: 10.7270/Q21N7ZKB