BDBM51129 3-Chloro-N-{5-[1-(1-methyl-1H-indol-3-yl)-meth-(Z)-ylidene]-4-oxo-2-thioxo-thiazolidin-3-yl}-benzamide::3-chloranyl-N-[(5Z)-5-[(1-methylindol-3-yl)methylidene]-4-oxidanylidene-2-sulfanylidene-1,3-thiazolidin-3-yl]benzamide::3-chloro-N-[(5Z)-4-keto-5-[(1-methylindol-3-yl)methylene]-2-thioxo-thiazolidin-3-yl]benzamide::3-chloro-N-[(5Z)-5-[(1-methyl-3-indolyl)methylidene]-4-oxo-2-sulfanylidene-3-thiazolidinyl]benzamide::3-chloro-N-[(5Z)-5-[(1-methylindol-3-yl)methylidene]-4-oxo-2-sulfanylidene-1,3-thiazolidin-3-yl]benzamide::MLS000580920::SMR000220311::cid_1992337
SMILES: Cn1cc(\C=C2/SC(=S)N(NC(=O)c3cccc(Cl)c3)C2=O)c2ccccc12
InChI Key: InChIKey=DFPQXESXYUVJLH-YVLHZVERSA-N
Data: 1 IC50
Activity Spreadsheet -- Enzyme Inhibition Constant Data from BindingDB
Found 1 hit for monomerid = 51129
Trg + Lig
Ki
nM
ΔG°
kcal/mole
IC50
nM
Kd
nM
EC50/IC50
nM
koff
s-1
kon
M-1s-1
pHTemp
°C
BZLF2
(Human herpesvirus 4 type 2)
BDBM51129
(3-Chloro-N-{5-[1-(1-methyl-1H-indol-3-yl)-meth-(Z)...)
Show SMILES Cn1cc(\C=C2/SC(=S)N(NC(=O)c3cccc(Cl)c3)C2=O)c2ccccc12
Show InChI InChI=1S/C20H14ClN3O2S2/c1-23-11-13(15-7-2-3-8-16(15)23)10-17-19(26)24(20(27)28-17)22-18(25)12-5-4-6-14(21)9-12/h2-11H,1H3,(H,22,25)/b17-10-
PCBioAssay
n/an/a 3.77E+3n/an/an/an/an/an/a
Emory University Molecular Libraries Screening Center
Curated by PubChem BioAssay
Assay Description
NIH Molecular Libraries Screening Centers Network [MLSCN] Emory Chemical Biology Discovery Center in MLSCN Assay provider: Theodore Jardetzky; Northw...
PubChem Bioassay (2008)
BindingDB Entry DOI: 10.7270/Q2057DCW