BDBM5133 (5Z)-4-[(3-chloro-4-fluorophenyl)amino]-5-{[3-methyl-5-(morpholin-4-ylcarbonyl)-1H-pyrrol-2-yl]methylidene}-5H,6H,7H-pyrrolo[2,3-d]pyrimidin-6-one::pyrrolo[2,3-d]pyrimidin-6-one deriv. 26k
SMILES: Cc1cc([nH]c1\C=C1/C(=O)Nc2ncnc(Nc3ccc(F)c(Cl)c3)c12)C(=O)N1CCOCC1
InChI Key: InChIKey=JQPOKKSPLVGJGJ-UVTDQMKNSA-N
Data: 3 IC50
Activity Spreadsheet -- Enzyme Inhibition Constant Data from BindingDB
Found 3 hits for monomerid = 5133
Trg + Lig
Ki
nM
ΔG°
kcal/mole
IC50
nM
Kd
nM
EC50/IC50
nM
koff
s-1
kon
M-1s-1
pHTemp
°C
Vascular endothelial growth factor receptor 2
(Homo sapiens (Human))
BDBM5133
((5Z)-4-[(3-chloro-4-fluorophenyl)amino]-5-{[3-meth...)
Show SMILES Cc1cc([nH]c1\C=C1/C(=O)Nc2ncnc(Nc3ccc(F)c(Cl)c3)c12)C(=O)N1CCOCC1
Show InChI InChI=1S/C23H20ClFN6O3/c1-12-8-18(23(33)31-4-6-34-7-5-31)29-17(12)10-14-19-20(26-11-27-21(19)30-22(14)32)28-13-2-3-16(25)15(24)9-13/h2-3,8-11,29H,4-7H2,1H3,(H2,26,27,28,30,32)/b14-10-
NCI pathway
Reactome pathway
n/an/a>2.00E+4n/an/an/an/a7.522
SUGEN, Inc.
Assay Description
The assays were performed in 96-well microtiter plates that had been coated with a polyGluTyr peptide. Negative control wells received buffer alone w...
Bioorg Med Chem Lett 12: 2153-7 (2002)
Article DOI: 10.1016/s0960-894x(02)00364-5
BindingDB Entry DOI: 10.7270/Q200009N
Platelet-derived growth factor receptor beta
(Homo sapiens (Human))
BDBM5133
((5Z)-4-[(3-chloro-4-fluorophenyl)amino]-5-{[3-meth...)
Show SMILES Cc1cc([nH]c1\C=C1/C(=O)Nc2ncnc(Nc3ccc(F)c(Cl)c3)c12)C(=O)N1CCOCC1
Show InChI InChI=1S/C23H20ClFN6O3/c1-12-8-18(23(33)31-4-6-34-7-5-31)29-17(12)10-14-19-20(26-11-27-21(19)30-22(14)32)28-13-2-3-16(25)15(24)9-13/h2-3,8-11,29H,4-7H2,1H3,(H2,26,27,28,30,32)/b14-10-
NCI pathway
Reactome pathway
n/an/a>2.00E+4n/an/an/an/an/an/a
SUGEN, Inc.
Assay Description
IC50 is the inhibitor concentration which inhibits 50% of EGF-R or PDGFR-beta kinase autophosphorylation activity. The assay was performed in 96-well...
Bioorg Med Chem Lett 12: 2153-7 (2002)
Article DOI: 10.1016/s0960-894x(02)00364-5
BindingDB Entry DOI: 10.7270/Q200009N
Epidermal growth factor receptor
(Homo sapiens (Human))
BDBM5133
((5Z)-4-[(3-chloro-4-fluorophenyl)amino]-5-{[3-meth...)
Show SMILES Cc1cc([nH]c1\C=C1/C(=O)Nc2ncnc(Nc3ccc(F)c(Cl)c3)c12)C(=O)N1CCOCC1
Show InChI InChI=1S/C23H20ClFN6O3/c1-12-8-18(23(33)31-4-6-34-7-5-31)29-17(12)10-14-19-20(26-11-27-21(19)30-22(14)32)28-13-2-3-16(25)15(24)9-13/h2-3,8-11,29H,4-7H2,1H3,(H2,26,27,28,30,32)/b14-10-
n/an/a 170n/an/an/an/an/an/a
SUGEN, Inc.
Assay Description
IC50 is the inhibitor concentration which inhibits 50% of EGF-R or PDGFR-beta kinase autophosphorylation activity. The assay was performed in 96-well...
Bioorg Med Chem Lett 12: 2153-7 (2002)
Article DOI: 10.1016/s0960-894x(02)00364-5
BindingDB Entry DOI: 10.7270/Q200009N