BDBM5134 (5Z)-4-[(3-chloro-4-fluorophenyl)amino]-5-({3-methyl-5-[(4-methylpiperazin-1-yl)carbonyl]-1H-pyrrol-2-yl}methylidene)-5H,6H,7H-pyrrolo[2,3-d]pyrimidin-6-one::pyrrolo[2,3-d]pyrimidin-6-one deriv. 26l
SMILES: CN1CCN(CC1)C(=O)c1cc(C)c(\C=C2/C(=O)Nc3ncnc(Nc4ccc(F)c(Cl)c4)c23)[nH]1
InChI Key: InChIKey=FNFNGVSJMJREKW-PTNGSMBKSA-N
Data: 3 IC50
Activity Spreadsheet -- Enzyme Inhibition Constant Data from BindingDB
Found 3 hits for monomerid = 5134
Trg + Lig
Ki
nM
ΔG°
kcal/mole
IC50
nM
Kd
nM
EC50/IC50
nM
koff
s-1
kon
M-1s-1
pHTemp
°C
Vascular endothelial growth factor receptor 2
(Homo sapiens (Human))
BDBM5134
((5Z)-4-[(3-chloro-4-fluorophenyl)amino]-5-({3-meth...)
Show SMILES CN1CCN(CC1)C(=O)c1cc(C)c(\C=C2/C(=O)Nc3ncnc(Nc4ccc(F)c(Cl)c4)c23)[nH]1
Show InChI InChI=1S/C24H23ClFN7O2/c1-13-9-19(24(35)33-7-5-32(2)6-8-33)30-18(13)11-15-20-21(27-12-28-22(20)31-23(15)34)29-14-3-4-17(26)16(25)10-14/h3-4,9-12,30H,5-8H2,1-2H3,(H2,27,28,29,31,34)/b15-11-
NCI pathway
Reactome pathway
n/an/a>2.00E+4n/an/an/an/a7.522
SUGEN, Inc.
Assay Description
The assays were performed in 96-well microtiter plates that had been coated with a polyGluTyr peptide. Negative control wells received buffer alone w...
Bioorg Med Chem Lett 12: 2153-7 (2002)
Article DOI: 10.1016/s0960-894x(02)00364-5
BindingDB Entry DOI: 10.7270/Q200009N
Platelet-derived growth factor receptor beta
(Homo sapiens (Human))
BDBM5134
((5Z)-4-[(3-chloro-4-fluorophenyl)amino]-5-({3-meth...)
Show SMILES CN1CCN(CC1)C(=O)c1cc(C)c(\C=C2/C(=O)Nc3ncnc(Nc4ccc(F)c(Cl)c4)c23)[nH]1
Show InChI InChI=1S/C24H23ClFN7O2/c1-13-9-19(24(35)33-7-5-32(2)6-8-33)30-18(13)11-15-20-21(27-12-28-22(20)31-23(15)34)29-14-3-4-17(26)16(25)10-14/h3-4,9-12,30H,5-8H2,1-2H3,(H2,27,28,29,31,34)/b15-11-
NCI pathway
Reactome pathway
n/an/a>2.00E+4n/an/an/an/an/an/a
SUGEN, Inc.
Assay Description
IC50 is the inhibitor concentration which inhibits 50% of EGF-R or PDGFR-beta kinase autophosphorylation activity. The assay was performed in 96-well...
Bioorg Med Chem Lett 12: 2153-7 (2002)
Article DOI: 10.1016/s0960-894x(02)00364-5
BindingDB Entry DOI: 10.7270/Q200009N
Epidermal growth factor receptor
(Homo sapiens (Human))
BDBM5134
((5Z)-4-[(3-chloro-4-fluorophenyl)amino]-5-({3-meth...)
Show SMILES CN1CCN(CC1)C(=O)c1cc(C)c(\C=C2/C(=O)Nc3ncnc(Nc4ccc(F)c(Cl)c4)c23)[nH]1
Show InChI InChI=1S/C24H23ClFN7O2/c1-13-9-19(24(35)33-7-5-32(2)6-8-33)30-18(13)11-15-20-21(27-12-28-22(20)31-23(15)34)29-14-3-4-17(26)16(25)10-14/h3-4,9-12,30H,5-8H2,1-2H3,(H2,27,28,29,31,34)/b15-11-
n/an/a 2.80n/an/an/an/an/an/a
SUGEN, Inc.
Assay Description
IC50 is the inhibitor concentration which inhibits 50% of EGF-R or PDGFR-beta kinase autophosphorylation activity. The assay was performed in 96-well...
Bioorg Med Chem Lett 12: 2153-7 (2002)
Article DOI: 10.1016/s0960-894x(02)00364-5
BindingDB Entry DOI: 10.7270/Q200009N