BDBM5139 (5Z)-4-[(3-chloro-4-fluorophenyl)amino]-5-({5-[(3,5-dimethylpiperazin-1-yl)carbonyl]-3-methyl-1H-pyrrol-2-yl}methylidene)-5H,6H,7H-pyrrolo[2,3-d]pyrimidin-6-one::pyrrolo[2,3-d]pyrimidin-6-one deriv. 26q
SMILES: CC1CN(CC(C)N1)C(=O)c1cc(C)c(\C=C2/C(=O)Nc3ncnc(Nc4ccc(F)c(Cl)c4)c23)[nH]1
InChI Key: InChIKey=WVDAQTVGUQLXLW-PXNMLYILSA-N
Data: 3 IC50
Activity Spreadsheet -- Enzyme Inhibition Constant Data from BindingDB
Found 3 hits for monomerid = 5139
Trg + Lig
Ki
nM
ΔG°
kcal/mole
IC50
nM
Kd
nM
EC50/IC50
nM
koff
s-1
kon
M-1s-1
pHTemp
°C
Vascular endothelial growth factor receptor 2
(Homo sapiens (Human))
BDBM5139
((5Z)-4-[(3-chloro-4-fluorophenyl)amino]-5-({5-[(3,...)
Show SMILES CC1CN(CC(C)N1)C(=O)c1cc(C)c(\C=C2/C(=O)Nc3ncnc(Nc4ccc(F)c(Cl)c4)c23)[nH]1
Show InChI InChI=1S/C25H25ClFN7O2/c1-12-6-20(25(36)34-9-13(2)30-14(3)10-34)32-19(12)8-16-21-22(28-11-29-23(21)33-24(16)35)31-15-4-5-18(27)17(26)7-15/h4-8,11,13-14,30,32H,9-10H2,1-3H3,(H2,28,29,31,33,35)/b16-8-
NCI pathway
Reactome pathway
n/an/a 1.63E+3n/an/an/an/a7.522
SUGEN, Inc.
Assay Description
The assays were performed in 96-well microtiter plates that had been coated with a polyGluTyr peptide. Negative control wells received buffer alone w...
Bioorg Med Chem Lett 12: 2153-7 (2002)
Article DOI: 10.1016/s0960-894x(02)00364-5
BindingDB Entry DOI: 10.7270/Q200009N
Platelet-derived growth factor receptor beta
(Homo sapiens (Human))
BDBM5139
((5Z)-4-[(3-chloro-4-fluorophenyl)amino]-5-({5-[(3,...)
Show SMILES CC1CN(CC(C)N1)C(=O)c1cc(C)c(\C=C2/C(=O)Nc3ncnc(Nc4ccc(F)c(Cl)c4)c23)[nH]1
Show InChI InChI=1S/C25H25ClFN7O2/c1-12-6-20(25(36)34-9-13(2)30-14(3)10-34)32-19(12)8-16-21-22(28-11-29-23(21)33-24(16)35)31-15-4-5-18(27)17(26)7-15/h4-8,11,13-14,30,32H,9-10H2,1-3H3,(H2,28,29,31,33,35)/b16-8-
NCI pathway
Reactome pathway
n/an/a>2.00E+4n/an/an/an/an/an/a
SUGEN, Inc.
Assay Description
IC50 is the inhibitor concentration which inhibits 50% of EGF-R or PDGFR-beta kinase autophosphorylation activity. The assay was performed in 96-well...
Bioorg Med Chem Lett 12: 2153-7 (2002)
Article DOI: 10.1016/s0960-894x(02)00364-5
BindingDB Entry DOI: 10.7270/Q200009N
Epidermal growth factor receptor
(Homo sapiens (Human))
BDBM5139
((5Z)-4-[(3-chloro-4-fluorophenyl)amino]-5-({5-[(3,...)
Show SMILES CC1CN(CC(C)N1)C(=O)c1cc(C)c(\C=C2/C(=O)Nc3ncnc(Nc4ccc(F)c(Cl)c4)c23)[nH]1
Show InChI InChI=1S/C25H25ClFN7O2/c1-12-6-20(25(36)34-9-13(2)30-14(3)10-34)32-19(12)8-16-21-22(28-11-29-23(21)33-24(16)35)31-15-4-5-18(27)17(26)7-15/h4-8,11,13-14,30,32H,9-10H2,1-3H3,(H2,28,29,31,33,35)/b16-8-
n/an/a 5.90n/an/an/an/an/an/a
SUGEN, Inc.
Assay Description
IC50 is the inhibitor concentration which inhibits 50% of EGF-R or PDGFR-beta kinase autophosphorylation activity. The assay was performed in 96-well...
Bioorg Med Chem Lett 12: 2153-7 (2002)
Article DOI: 10.1016/s0960-894x(02)00364-5
BindingDB Entry DOI: 10.7270/Q200009N