BDBM5141 5-{[(5Z)-4-[(3-ethynylphenyl)amino]-6-oxo-5H,6H,7H-pyrrolo[2,3-d]pyrimidin-5-ylidene]methyl}-4-methyl-N-[2-(morpholin-4-yl)ethyl]-1H-pyrrole-2-carboxamide::pyrrolo[2,3-d]pyrimidin-6-one deriv. 26s
SMILES: Cc1cc([nH]c1\C=C1/C(=O)Nc2ncnc(Nc3cccc(c3)C#C)c12)C(=O)NCCN1CCOCC1
InChI Key: InChIKey=ZJXFDKWJAGZFLT-HKWRFOASSA-N
Data: 3 IC50
Activity Spreadsheet -- Enzyme Inhibition Constant Data from BindingDB
Found 3 hits for monomerid = 5141
Trg + Lig
Ki
nM
ΔG°
kcal/mole
IC50
nM
Kd
nM
EC50/IC50
nM
koff
s-1
kon
M-1s-1
pHTemp
°C
Vascular endothelial growth factor receptor 2
(Homo sapiens (Human))
BDBM5141
(5-{[(5Z)-4-[(3-ethynylphenyl)amino]-6-oxo-5H,6H,7H...)
Show SMILES Cc1cc([nH]c1\C=C1/C(=O)Nc2ncnc(Nc3cccc(c3)C#C)c12)C(=O)NCCN1CCOCC1
Show InChI InChI=1S/C27H27N7O3/c1-3-18-5-4-6-19(14-18)31-24-23-20(26(35)33-25(23)30-16-29-24)15-21-17(2)13-22(32-21)27(36)28-7-8-34-9-11-37-12-10-34/h1,4-6,13-16,32H,7-12H2,2H3,(H,28,36)(H2,29,30,31,33,35)/b20-15-
NCI pathway
Reactome pathway
n/an/a>2.00E+4n/an/an/an/an/an/a
SUGEN, Inc.
Assay Description
The assays were performed in 96-well microtiter plates that had been coated with a polyGluTyr peptide. Negative control wells received buffer alone w...
Bioorg Med Chem Lett 12: 2153-7 (2002)
Article DOI: 10.1016/s0960-894x(02)00364-5
BindingDB Entry DOI: 10.7270/Q200009N
Platelet-derived growth factor receptor beta
(Homo sapiens (Human))
BDBM5141
(5-{[(5Z)-4-[(3-ethynylphenyl)amino]-6-oxo-5H,6H,7H...)
Show SMILES Cc1cc([nH]c1\C=C1/C(=O)Nc2ncnc(Nc3cccc(c3)C#C)c12)C(=O)NCCN1CCOCC1
Show InChI InChI=1S/C27H27N7O3/c1-3-18-5-4-6-19(14-18)31-24-23-20(26(35)33-25(23)30-16-29-24)15-21-17(2)13-22(32-21)27(36)28-7-8-34-9-11-37-12-10-34/h1,4-6,13-16,32H,7-12H2,2H3,(H,28,36)(H2,29,30,31,33,35)/b20-15-
NCI pathway
Reactome pathway
n/an/a>2.00E+4n/an/an/an/an/an/a
SUGEN, Inc.
Assay Description
IC50 is the inhibitor concentration which inhibits 50% of EGF-R or PDGFR-beta kinase autophosphorylation activity. The assay was performed in 96-well...
Bioorg Med Chem Lett 12: 2153-7 (2002)
Article DOI: 10.1016/s0960-894x(02)00364-5
BindingDB Entry DOI: 10.7270/Q200009N
Epidermal growth factor receptor
(Homo sapiens (Human))
BDBM5141
(5-{[(5Z)-4-[(3-ethynylphenyl)amino]-6-oxo-5H,6H,7H...)
Show SMILES Cc1cc([nH]c1\C=C1/C(=O)Nc2ncnc(Nc3cccc(c3)C#C)c12)C(=O)NCCN1CCOCC1
Show InChI InChI=1S/C27H27N7O3/c1-3-18-5-4-6-19(14-18)31-24-23-20(26(35)33-25(23)30-16-29-24)15-21-17(2)13-22(32-21)27(36)28-7-8-34-9-11-37-12-10-34/h1,4-6,13-16,32H,7-12H2,2H3,(H,28,36)(H2,29,30,31,33,35)/b20-15-
n/an/a 18n/an/an/an/an/an/a
SUGEN, Inc.
Assay Description
IC50 is the inhibitor concentration which inhibits 50% of EGF-R or PDGFR-beta kinase autophosphorylation activity. The assay was performed in 96-well...
Bioorg Med Chem Lett 12: 2153-7 (2002)
Article DOI: 10.1016/s0960-894x(02)00364-5
BindingDB Entry DOI: 10.7270/Q200009N