BDBM5146 5-{[(5Z)-4-[(1-benzyl-1H-indol-5-yl)amino]-6-oxo-5H,6H,7H-pyrrolo[2,3-d]pyrimidin-5-ylidene]methyl}-4-methyl-N-[2-(morpholin-4-yl)ethyl]-1H-pyrrole-2-carboxamide::pyrrolo[2,3-d]pyrimidin-6-one deriv. 28d
SMILES: Cc1cc([nH]c1\C=C1/C(=O)Nc2ncnc(Nc3ccc4n(Cc5ccccc5)ccc4c3)c12)C(=O)NCCN1CCOCC1
InChI Key: InChIKey=JHZHWAOFJSCIEJ-XHPQRKPJSA-N
Data: 3 IC50
Activity Spreadsheet -- Enzyme Inhibition Constant Data from BindingDB
Found 3 hits for monomerid = 5146
Trg + Lig
Ki
nM
ΔG°
kcal/mole
IC50
nM
Kd
nM
EC50/IC50
nM
koff
s-1
kon
M-1s-1
pHTemp
°C
Vascular endothelial growth factor receptor 2
(Homo sapiens (Human))
BDBM5146
(5-{[(5Z)-4-[(1-benzyl-1H-indol-5-yl)amino]-6-oxo-5...)
Show SMILES Cc1cc([nH]c1\C=C1/C(=O)Nc2ncnc(Nc3ccc4n(Cc5ccccc5)ccc4c3)c12)C(=O)NCCN1CCOCC1
Show InChI InChI=1S/C34H34N8O3/c1-22-17-28(34(44)35-10-12-41-13-15-45-16-14-41)39-27(22)19-26-30-31(36-21-37-32(30)40-33(26)43)38-25-7-8-29-24(18-25)9-11-42(29)20-23-5-3-2-4-6-23/h2-9,11,17-19,21,39H,10,12-16,20H2,1H3,(H,35,44)(H2,36,37,38,40,43)/b26-19-
NCI pathway
Reactome pathway
n/an/a 3.47E+3n/an/an/an/an/an/a
SUGEN, Inc.
Assay Description
The assays were performed in 96-well microtiter plates that had been coated with a polyGluTyr peptide. Negative control wells received buffer alone w...
Bioorg Med Chem Lett 12: 2153-7 (2002)
Article DOI: 10.1016/s0960-894x(02)00364-5
BindingDB Entry DOI: 10.7270/Q200009N
Platelet-derived growth factor receptor beta
(Homo sapiens (Human))
BDBM5146
(5-{[(5Z)-4-[(1-benzyl-1H-indol-5-yl)amino]-6-oxo-5...)
Show SMILES Cc1cc([nH]c1\C=C1/C(=O)Nc2ncnc(Nc3ccc4n(Cc5ccccc5)ccc4c3)c12)C(=O)NCCN1CCOCC1
Show InChI InChI=1S/C34H34N8O3/c1-22-17-28(34(44)35-10-12-41-13-15-45-16-14-41)39-27(22)19-26-30-31(36-21-37-32(30)40-33(26)43)38-25-7-8-29-24(18-25)9-11-42(29)20-23-5-3-2-4-6-23/h2-9,11,17-19,21,39H,10,12-16,20H2,1H3,(H,35,44)(H2,36,37,38,40,43)/b26-19-
NCI pathway
Reactome pathway
n/an/a>1.00E+5n/an/an/an/an/an/a
SUGEN, Inc.
Assay Description
IC50 is the inhibitor concentration which inhibits 50% of EGF-R or PDGFR-beta kinase autophosphorylation activity. The assay was performed in 96-well...
Bioorg Med Chem Lett 12: 2153-7 (2002)
Article DOI: 10.1016/s0960-894x(02)00364-5
BindingDB Entry DOI: 10.7270/Q200009N
Epidermal growth factor receptor
(Homo sapiens (Human))
BDBM5146
(5-{[(5Z)-4-[(1-benzyl-1H-indol-5-yl)amino]-6-oxo-5...)
Show SMILES Cc1cc([nH]c1\C=C1/C(=O)Nc2ncnc(Nc3ccc4n(Cc5ccccc5)ccc4c3)c12)C(=O)NCCN1CCOCC1
Show InChI InChI=1S/C34H34N8O3/c1-22-17-28(34(44)35-10-12-41-13-15-45-16-14-41)39-27(22)19-26-30-31(36-21-37-32(30)40-33(26)43)38-25-7-8-29-24(18-25)9-11-42(29)20-23-5-3-2-4-6-23/h2-9,11,17-19,21,39H,10,12-16,20H2,1H3,(H,35,44)(H2,36,37,38,40,43)/b26-19-
n/an/a 1.10n/an/an/an/an/an/a
SUGEN, Inc.
Assay Description
IC50 is the inhibitor concentration which inhibits 50% of EGF-R or PDGFR-beta kinase autophosphorylation activity. The assay was performed in 96-well...
Bioorg Med Chem Lett 12: 2153-7 (2002)
Article DOI: 10.1016/s0960-894x(02)00364-5
BindingDB Entry DOI: 10.7270/Q200009N