BDBM5179 2-chloro-6-methoxy-3-phenylquinoline::Quinoline-Containing Inhibitor 13
SMILES: COc1ccc2nc(Cl)c(cc2c1)-c1ccccc1
InChI Key: InChIKey=GGBHOBDCDNXFFD-UHFFFAOYSA-N
Data: 2 IC50
Activity Spreadsheet -- Enzyme Inhibition Constant Data from BindingDB
Found 2 hits for monomerid = 5179
Trg + Lig
Ki
nM
ΔG°
kcal/mole
IC50
nM
Kd
nM
EC50/IC50
nM
koff
s-1
kon
M-1s-1
pHTemp
°C
Platelet-derived growth factor receptor beta
(Homo sapiens (Human))
BDBM5179
(2-chloro-6-methoxy-3-phenylquinoline | Quinoline-C...)
Show SMILES COc1ccc2nc(Cl)c(cc2c1)-c1ccccc1
Show InChI InChI=1S/C16H12ClNO/c1-19-13-7-8-15-12(9-13)10-14(16(17)18-15)11-5-3-2-4-6-11/h2-10H,1H3
NCI pathway
Reactome pathway
n/an/a>3.00E+4n/an/an/an/an/an/a
Hebrew University of Jerusalem
Assay Description
The assay was using Swiss 3T3 cell membranes harboring EGF-R or PDGFR-beta. Receptor autophosphorylation was initiated by addition of [gamma-32P]ATP ...
J Med Chem 39: 2170-7 (1996)
Article DOI: 10.1021/jm950727b
BindingDB Entry DOI: 10.7270/Q2QF8R2N
Epidermal growth factor receptor
(Homo sapiens (Human))
BDBM5179
(2-chloro-6-methoxy-3-phenylquinoline | Quinoline-C...)
Show SMILES COc1ccc2nc(Cl)c(cc2c1)-c1ccccc1
Show InChI InChI=1S/C16H12ClNO/c1-19-13-7-8-15-12(9-13)10-14(16(17)18-15)11-5-3-2-4-6-11/h2-10H,1H3
n/an/a>3.00E+4n/an/an/an/a7.54
Hebrew University of Jerusalem
Assay Description
The assay was using Swiss 3T3 cell membranes harboring EGF-R or PDGFR-beta. Receptor autophosphorylation was initiated by addition of [gamma-32P]ATP ...
J Med Chem 39: 2170-7 (1996)
Article DOI: 10.1021/jm950727b
BindingDB Entry DOI: 10.7270/Q2QF8R2N