BDBM5185 (2-(p-Nitrophenyl)-3-carbomethoxy-6,7-dimethoxyquinoline)::Quinoline-Containing Inhibitor 19::methyl 6,7-dimethoxy-2-(4-nitrophenyl)quinoline-3-carboxylate
SMILES: COC(=O)c1cc2cc(OC)c(OC)cc2nc1-c1ccc(cc1)[N+]([O-])=O
InChI Key: InChIKey=ZHROVCLRKOLMGN-UHFFFAOYSA-N
Data: 2 IC50
Activity Spreadsheet -- Enzyme Inhibition Constant Data from BindingDB
Found 2 hits for monomerid = 5185
Trg + Lig
Ki
nM
ΔG°
kcal/mole
IC50
nM
Kd
nM
EC50/IC50
nM
koff
s-1
kon
M-1s-1
pHTemp
°C
Platelet-derived growth factor receptor beta
(Homo sapiens (Human))
BDBM5185
((2-(p-Nitrophenyl)-3-carbomethoxy-6,7-dimethoxyqui...)
Show SMILES COC(=O)c1cc2cc(OC)c(OC)cc2nc1-c1ccc(cc1)[N+]([O-])=O
Show InChI InChI=1S/C19H16N2O6/c1-25-16-9-12-8-14(19(22)27-3)18(20-15(12)10-17(16)26-2)11-4-6-13(7-5-11)21(23)24/h4-10H,1-3H3
NCI pathway
Reactome pathway
n/an/a>3.00E+4n/an/an/an/an/an/a
Hebrew University of Jerusalem
Assay Description
The assay was using Swiss 3T3 cell membranes harboring EGF-R or PDGFR-beta. Receptor autophosphorylation was initiated by addition of [gamma-32P]ATP ...
J Med Chem 39: 2170-7 (1996)
Article DOI: 10.1021/jm950727b
BindingDB Entry DOI: 10.7270/Q2QF8R2N
Epidermal growth factor receptor
(Homo sapiens (Human))
BDBM5185
((2-(p-Nitrophenyl)-3-carbomethoxy-6,7-dimethoxyqui...)
Show SMILES COC(=O)c1cc2cc(OC)c(OC)cc2nc1-c1ccc(cc1)[N+]([O-])=O
Show InChI InChI=1S/C19H16N2O6/c1-25-16-9-12-8-14(19(22)27-3)18(20-15(12)10-17(16)26-2)11-4-6-13(7-5-11)21(23)24/h4-10H,1-3H3
n/an/a>3.00E+4n/an/an/an/a7.54
Hebrew University of Jerusalem
Assay Description
The assay was using Swiss 3T3 cell membranes harboring EGF-R or PDGFR-beta. Receptor autophosphorylation was initiated by addition of [gamma-32P]ATP ...
J Med Chem 39: 2170-7 (1996)
Article DOI: 10.1021/jm950727b
BindingDB Entry DOI: 10.7270/Q2QF8R2N