BDBM5188 2-(naphthalen-1-ylmethylidene)propanedinitrile::naphthalene deriv. 22
SMILES: N#C\[#6](=[#6]\c1cccc2ccccc12)C#N
InChI Key: InChIKey=HNVAUTUJXUMGPH-UHFFFAOYSA-N
Data: 2 IC50
Activity Spreadsheet -- Enzyme Inhibition Constant Data from BindingDB
Found 2 hits for monomerid = 5188
Trg + Lig
Ki
nM
ΔG°
kcal/mole
IC50
nM
Kd
nM
EC50/IC50
nM
koff
s-1
kon
M-1s-1
pHTemp
°C
Platelet-derived growth factor receptor beta
(Homo sapiens (Human))
BDBM5188
(2-(naphthalen-1-ylmethylidene)propanedinitrile | n...)
Show SMILES N#C\[#6](=[#6]\c1cccc2ccccc12)C#N
Show InChI InChI=1S/C14H8N2/c15-9-11(10-16)8-13-6-3-5-12-4-1-2-7-14(12)13/h1-8H
NCI pathway
Reactome pathway
n/an/a>1.00E+5n/an/an/an/an/an/a
Hebrew University of Jerusalem
Assay Description
The assay was using Swiss 3T3 cell membranes harboring EGF-R or PDGFR-beta. Receptor autophosphorylation was initiated by addition of [gamma-32P]ATP ...
J Med Chem 39: 2170-7 (1996)
Article DOI: 10.1021/jm950727b
BindingDB Entry DOI: 10.7270/Q2QF8R2N
Epidermal growth factor receptor
(Homo sapiens (Human))
BDBM5188
(2-(naphthalen-1-ylmethylidene)propanedinitrile | n...)
Show SMILES N#C\[#6](=[#6]\c1cccc2ccccc12)C#N
Show InChI InChI=1S/C14H8N2/c15-9-11(10-16)8-13-6-3-5-12-4-1-2-7-14(12)13/h1-8H
n/an/a>1.00E+5n/an/an/an/a7.54
Hebrew University of Jerusalem
Assay Description
The assay was using Swiss 3T3 cell membranes harboring EGF-R or PDGFR-beta. Receptor autophosphorylation was initiated by addition of [gamma-32P]ATP ...
J Med Chem 39: 2170-7 (1996)
Article DOI: 10.1021/jm950727b
BindingDB Entry DOI: 10.7270/Q2QF8R2N