BDBM51881 2-(diethylamino)ethyl 4-[[(Z)-2-cyano-2-[4-(4-methoxyphenyl)-1,3-thiazol-2-yl]ethenyl]amino]benzoate::4-[[(Z)-2-cyano-2-[4-(4-methoxyphenyl)-2-thiazolyl]ethenyl]amino]benzoic acid 2-(diethylamino)ethyl ester::4-[[(Z)-2-cyano-2-[4-(4-methoxyphenyl)thiazol-2-yl]vinyl]amino]benzoic acid 2-(diethylamino)ethyl ester::4-{(Z)-2-Cyano-2-[4-(4-methoxy-phenyl)-thiazol-2-yl]-vinylamino}-benzoic acid 2-diethylamino-ethyl ester::MLS000769344::SMR000434078::cid_1833641
SMILES: CCN(CC)CCOC(=O)c1ccc(cc1)N=CC(C#N)c1nc(cs1)-c1ccc(OC)cc1
InChI Key: InChIKey=JRKRKQBBHCTDED-UHFFFAOYSA-N
Data: 4 IC50  2 EC50
Activity Spreadsheet -- Enzyme Inhibition Constant Data from BindingDB
Found 6 hits for monomerid = 51881
Trg + Lig
Ki
nM
ΔG°
kcal/mole
IC50
nM
Kd
nM
EC50/IC50
nM
koff
s-1
kon
M-1s-1
pHTemp
°C
Mitogen-activated protein kinase kinase kinase kinase 2
(Homo sapiens (Human))
BDBM51881
(2-(diethylamino)ethyl 4-[[(Z)-2-cyano-2-[4-(4-meth...)
Show SMILES CCN(CC)CCOC(=O)c1ccc(cc1)N=CC(C#N)c1nc(cs1)-c1ccc(OC)cc1 |w:16.16|
Show InChI InChI=1S/C26H28N4O3S/c1-4-30(5-2)14-15-33-26(31)20-6-10-22(11-7-20)28-17-21(16-27)25-29-24(18-34-25)19-8-12-23(32-3)13-9-19/h6-13,17-18,21H,4-5,14-15H2,1-3H3
Reactome pathway
PCBioAssay
n/an/an/an/a 3.00E+4n/an/an/an/a
NMMLSC
Curated by PubChem BioAssay
Assay Description
University of New Mexico Assay Overview: Assay Support: 1R03MH084830-01 Project Title: TR-FRET HTS Assay for Inhibitors of MEKK2-MEK5 PB1 Domain...
PubChem Bioassay (2009)
BindingDB Entry DOI: 10.7270/Q25Q4THK
Mitogen-activated protein kinase kinase kinase kinase 2
(Homo sapiens (Human))
BDBM51881
(2-(diethylamino)ethyl 4-[[(Z)-2-cyano-2-[4-(4-meth...)
Show SMILES CCN(CC)CCOC(=O)c1ccc(cc1)N=CC(C#N)c1nc(cs1)-c1ccc(OC)cc1 |w:16.16|
Show InChI InChI=1S/C26H28N4O3S/c1-4-30(5-2)14-15-33-26(31)20-6-10-22(11-7-20)28-17-21(16-27)25-29-24(18-34-25)19-8-12-23(32-3)13-9-19/h6-13,17-18,21H,4-5,14-15H2,1-3H3
Reactome pathway
PCBioAssay
n/an/an/an/a 3.00E+4n/an/an/an/a
NMMLSC
Curated by PubChem BioAssay
Assay Description
University of New Mexico Assay Overview: Assay Support: 1R03MH084830-01 Project Title: TR-FRET HTS Assay for Inhibitors of MEKK2-MEK5 PB1 Domain...
PubChem Bioassay (2009)
BindingDB Entry DOI: 10.7270/Q21Z42TP
Tegument protein VP16
(Human herpesvirus 1 (strain 17) (HHV-1) (Human her...)
BDBM51881
(2-(diethylamino)ethyl 4-[[(Z)-2-cyano-2-[4-(4-meth...)
Show SMILES CCN(CC)CCOC(=O)c1ccc(cc1)N=CC(C#N)c1nc(cs1)-c1ccc(OC)cc1 |w:16.16|
Show InChI InChI=1S/C26H28N4O3S/c1-4-30(5-2)14-15-33-26(31)20-6-10-22(11-7-20)28-17-21(16-27)25-29-24(18-34-25)19-8-12-23(32-3)13-9-19/h6-13,17-18,21H,4-5,14-15H2,1-3H3
PCBioAssay
n/an/a 3.70E+4n/an/an/an/an/an/a
The Scripps Research Institute Molecular Screening Center
Curated by PubChem BioAssay
Assay Description
Source (MLPCN Center Name): The Scripps Research Institute Molecular Screening Center Affiliation: The Scripps Research Institute, TSRI Assay Provide...
PubChem Bioassay (2013)
BindingDB Entry DOI: 10.7270/Q2GM85ZT
Bcl-2-related protein A1
(Mus musculus (Mouse))
BDBM51881
(2-(diethylamino)ethyl 4-[[(Z)-2-cyano-2-[4-(4-meth...)
Show SMILES CCN(CC)CCOC(=O)c1ccc(cc1)N=CC(C#N)c1nc(cs1)-c1ccc(OC)cc1 |w:16.16|
Show InChI InChI=1S/C26H28N4O3S/c1-4-30(5-2)14-15-33-26(31)20-6-10-22(11-7-20)28-17-21(16-27)25-29-24(18-34-25)19-8-12-23(32-3)13-9-19/h6-13,17-18,21H,4-5,14-15H2,1-3H3
PCBioAssay
n/an/a 2.99E+3n/an/an/an/an/an/a
Burnham Center for Chemical Genomics
Curated by PubChem BioAssay
Assay Description
Data Source: Sanford-Burnham Center for Chemical Genomics (SBCCG) Source Affiliation: Sanford-Burnham Medical Research Institute (SBMRI, San Diego CA...
PubChem Bioassay (2011)
BindingDB Entry DOI: 10.7270/Q25D8Q92
Ubiquitin-conjugating enzyme E2 N
(Homo sapiens (Human))
BDBM51881
(2-(diethylamino)ethyl 4-[[(Z)-2-cyano-2-[4-(4-meth...)
Show SMILES CCN(CC)CCOC(=O)c1ccc(cc1)N=CC(C#N)c1nc(cs1)-c1ccc(OC)cc1 |w:16.16|
Show InChI InChI=1S/C26H28N4O3S/c1-4-30(5-2)14-15-33-26(31)20-6-10-22(11-7-20)28-17-21(16-27)25-29-24(18-34-25)19-8-12-23(32-3)13-9-19/h6-13,17-18,21H,4-5,14-15H2,1-3H3
Reactome pathway
PCBioAssay
n/an/a 4.30E+3n/an/an/an/an/an/a
Burnham Center for Chemical Genomics
Curated by PubChem BioAssay
Assay Description
Data Source: Sanford-Burnham Center for Chemical Genomics (SBCCG) Source Affiliation: Sanford-Burnham Medical Research Institute (SBMRI, San Diego CA...
PubChem Bioassay (2011)
BindingDB Entry DOI: 10.7270/Q2SB4462
Ubiquitin-conjugating enzyme E2 N
(Homo sapiens (Human))
BDBM51881
(2-(diethylamino)ethyl 4-[[(Z)-2-cyano-2-[4-(4-meth...)
Show SMILES CCN(CC)CCOC(=O)c1ccc(cc1)N=CC(C#N)c1nc(cs1)-c1ccc(OC)cc1 |w:16.16|
Show InChI InChI=1S/C26H28N4O3S/c1-4-30(5-2)14-15-33-26(31)20-6-10-22(11-7-20)28-17-21(16-27)25-29-24(18-34-25)19-8-12-23(32-3)13-9-19/h6-13,17-18,21H,4-5,14-15H2,1-3H3
Reactome pathway
PCBioAssay
n/an/a 4.88E+3n/an/an/an/an/an/a
Burnham Center for Chemical Genomics
Curated by PubChem BioAssay
Assay Description
Data Source: Sanford-Burnham Center for Chemical Genomics (SBCCG) Source Affiliation: Sanford-Burnham Medical Research Institute (SBMRI, San Diego CA...
PubChem Bioassay (2011)
BindingDB Entry DOI: 10.7270/Q2X34VX0