BDBM51976 4-[(2-methyl-3-phenyl-2-propen-1-ylidene)amino]-5-(4-pyridinyl)-4H-1,2,4-triazole-3-thiol::4-[[(Z)-2-methyl-3-phenyl-prop-2-enylidene]amino]-3-(4-pyridyl)-1H-1,2,4-triazole-5-thione::4-[[(Z)-2-methyl-3-phenyl-prop-2-enylidene]amino]-3-pyridin-4-yl-1H-1,2,4-triazole-5-thione::4-[[(Z)-2-methyl-3-phenylprop-2-enylidene]amino]-3-pyridin-4-yl-1H-1,2,4-triazole-5-thione::MLS000676258::SMR000272003::cid_895803
SMILES: CC(C=Nn1c(n[nH]c1=S)-c1ccncc1)=Cc1ccccc1
InChI Key: InChIKey=UOWIBMOFVIKGGB-UHFFFAOYSA-N
Data: 6 IC50
Activity Spreadsheet -- Enzyme Inhibition Constant Data from BindingDB
Found 6 hits for monomerid = 51976
Trg + Lig
Ki
nM
ΔG°
kcal/mole
IC50
nM
Kd
nM
EC50/IC50
nM
koff
s-1
kon
M-1s-1
pHTemp
°C
Beta lactamase
(Pseudomonas aeruginosa)
BDBM51976
(4-[(2-methyl-3-phenyl-2-propen-1-ylidene)amino]-5-...)
Show SMILES CC(C=Nn1c(n[nH]c1=S)-c1ccncc1)=Cc1ccccc1 |w:3.3,16.18|
Show InChI InChI=1S/C17H15N5S/c1-13(11-14-5-3-2-4-6-14)12-19-22-16(20-21-17(22)23)15-7-9-18-10-8-15/h2-12H,1H3,(H,21,23)
PCBioAssay
n/an/a 5.96E+4n/an/an/an/an/an/a
The Scripps Research Institute Molecular Screening Center
Curated by PubChem BioAssay
Assay Description
Source (MLPCN Center Name): The Scripps Research Institute Molecular Screening Center (SRIMSC) Center Affiliation: The Scripps Research Institute (TS...
PubChem Bioassay (2009)
BindingDB Entry DOI: 10.7270/Q2X63KBQ
metallo-beta-lactamase IMP-1
(Pseudomonas aeruginosa)
BDBM51976
(4-[(2-methyl-3-phenyl-2-propen-1-ylidene)amino]-5-...)
Show SMILES CC(C=Nn1c(n[nH]c1=S)-c1ccncc1)=Cc1ccccc1 |w:3.3,16.18|
Show InChI InChI=1S/C17H15N5S/c1-13(11-14-5-3-2-4-6-14)12-19-22-16(20-21-17(22)23)15-7-9-18-10-8-15/h2-12H,1H3,(H,21,23)
PCBioAssay
n/an/a 5.96E+4n/an/an/an/an/an/a
The Scripps Research Institute Molecular Screening Center
Curated by PubChem BioAssay
Assay Description
Source (MLPCN Center Name): The Scripps Research Institute Molecular Screening Center (SRIMSC) Center Affiliation: The Scripps Research Institute (TS...
PubChem Bioassay (2009)
BindingDB Entry DOI: 10.7270/Q2SF2TM0
probable DNA dC->dU-editing enzyme APOBEC-3A
(Homo sapiens (Human))
BDBM51976
(4-[(2-methyl-3-phenyl-2-propen-1-ylidene)amino]-5-...)
Show SMILES CC(C=Nn1c(n[nH]c1=S)-c1ccncc1)=Cc1ccccc1 |w:3.3,16.18|
Show InChI InChI=1S/C17H15N5S/c1-13(11-14-5-3-2-4-6-14)12-19-22-16(20-21-17(22)23)15-7-9-18-10-8-15/h2-12H,1H3,(H,21,23)
PCBioAssay
n/an/a>1.00E+5n/an/an/an/an/a25
Burnham Center for Chemical Genomics
Curated by PubChem BioAssay
Assay Description
Data Source: Sanford-Burnham Center for Chemical Genomics (SBCCG) Source Affiliation: Sanford-Burnham Medical Research Institute (SBMRI, San Diego, C...
PubChem Bioassay (2011)
BindingDB Entry DOI: 10.7270/Q2CZ35ND
metallo-beta-lactamase IMP-1
(Pseudomonas aeruginosa)
BDBM51976
(4-[(2-methyl-3-phenyl-2-propen-1-ylidene)amino]-5-...)
Show SMILES CC(C=Nn1c(n[nH]c1=S)-c1ccncc1)=Cc1ccccc1 |w:3.3,16.18|
Show InChI InChI=1S/C17H15N5S/c1-13(11-14-5-3-2-4-6-14)12-19-22-16(20-21-17(22)23)15-7-9-18-10-8-15/h2-12H,1H3,(H,21,23)
PCBioAssay
n/an/a 5.96E+4n/an/an/an/an/an/a
The Scripps Research Institute Molecular Screening Center
Curated by PubChem BioAssay
Assay Description
Source (MLPCN Center Name): The Scripps Research Institute Molecular Screening Center (SRIMSC) Center Affiliation: The Scripps Research Institute (TS...
PubChem Bioassay (2009)
BindingDB Entry DOI: 10.7270/Q2J101MD
DNA dC->dU-editing enzyme APOBEC-3G
(Homo sapiens (Human))
BDBM51976
(4-[(2-methyl-3-phenyl-2-propen-1-ylidene)amino]-5-...)
Show SMILES CC(C=Nn1c(n[nH]c1=S)-c1ccncc1)=Cc1ccccc1 |w:3.3,16.18|
Show InChI InChI=1S/C17H15N5S/c1-13(11-14-5-3-2-4-6-14)12-19-22-16(20-21-17(22)23)15-7-9-18-10-8-15/h2-12H,1H3,(H,21,23)
PCBioAssay
n/an/a 2.33E+3n/an/an/an/an/a25
Burnham Center for Chemical Genomics
Curated by PubChem BioAssay
Assay Description
Data Source: Sanford-Burnham Center for Chemical Genomics (SBCCG) Source Affiliation: Sanford-Burnham Medical Research Institute (SBMRI, San Diego, C...
PubChem Bioassay (2011)
BindingDB Entry DOI: 10.7270/Q2HQ3XD6
Beta lactamase
(Pseudomonas aeruginosa)
BDBM51976
(4-[(2-methyl-3-phenyl-2-propen-1-ylidene)amino]-5-...)
Show SMILES CC(C=Nn1c(n[nH]c1=S)-c1ccncc1)=Cc1ccccc1 |w:3.3,16.18|
Show InChI InChI=1S/C17H15N5S/c1-13(11-14-5-3-2-4-6-14)12-19-22-16(20-21-17(22)23)15-7-9-18-10-8-15/h2-12H,1H3,(H,21,23)
PCBioAssay
n/an/a 3.26E+3n/an/an/an/an/an/a
The Scripps Research Institute Molecular Screening Center
Curated by PubChem BioAssay
Assay Description
Source (MLPCN Center Name): The Scripps Research Institute Molecular Screening Center (SRIMSC) Center Affiliation: The Scripps Research Institute (TS...
PubChem Bioassay (2009)
BindingDB Entry DOI: 10.7270/Q2NS0S90