null
SMILES: Cc1ccc(cc1C)-n1c2nc3ccccn3c(=O)c2cc(C#N)c1=O
InChI Key: InChIKey=KMGKYDMQPCVWOS-UHFFFAOYSA-N
Activity Spreadsheet -- Enzyme Inhibition Constant Data from BindingDB
Found 3 hits for monomerid = 52272
Trg + Lig
Ki
nM
ΔG°
kcal/mole
IC50
nM
Kd
nM
EC50/IC50
nM
koff
s-1
kon
M-1s-1
pHTemp
°C
POsterior Segregation
(Caenorhabditis elegans)
BDBM52272
(1-(3,4-dimethylphenyl)-2,5-bis(oxidanylidene)dipyr...)
Show SMILES Cc1ccc(cc1C)-n1c2nc3ccccn3c(=O)c2cc(C#N)c1=O
Show InChI InChI=1S/C20H14N4O2/c1-12-6-7-15(9-13(12)2)24-18-16(10-14(11-21)19(24)25)20(26)23-8-4-3-5-17(23)22-18/h3-10H,1-2H3
PCBioAssay
n/an/an/an/a 3.00E+5n/an/an/an/a
Broad Institute
Curated by PubChem BioAssay
Assay Description
Broad Institute: MLPCN maternal gene expression Project ID: 2024 Keywords: Zinc finger, C. elegans, maternal gene expression, RNA-protein interac...
PubChem Bioassay (2009)
BindingDB Entry DOI: 10.7270/Q28G8J4C
Importin subunit alpha-1
(Homo sapiens (Human))
BDBM52272
(1-(3,4-dimethylphenyl)-2,5-bis(oxidanylidene)dipyr...)
Show SMILES Cc1ccc(cc1C)-n1c2nc3ccccn3c(=O)c2cc(C#N)c1=O
Show InChI InChI=1S/C20H14N4O2/c1-12-6-7-15(9-13(12)2)24-18-16(10-14(11-21)19(24)25)20(26)23-8-4-3-5-17(23)22-18/h3-10H,1-2H3
Reactome pathway
PCBioAssay
n/an/an/an/a 1.78E+3n/an/an/an/a
Broad Institute
Curated by PubChem BioAssay
Assay Description
Keywords: Counterscreen, FRET assay, HTS, YIC probe, Dose response, Assay Overview: This is a fluorescence resonance energy transfer (FRET)-based b...
PubChem Bioassay (2010)
BindingDB Entry DOI: 10.7270/Q280513R
Zinc finger protein mex-5
(Caenorhabditis elegans)
BDBM52272
(1-(3,4-dimethylphenyl)-2,5-bis(oxidanylidene)dipyr...)
Show SMILES Cc1ccc(cc1C)-n1c2nc3ccccn3c(=O)c2cc(C#N)c1=O
Show InChI InChI=1S/C20H14N4O2/c1-12-6-7-15(9-13(12)2)24-18-16(10-14(11-21)19(24)25)20(26)23-8-4-3-5-17(23)22-18/h3-10H,1-2H3
PCBioAssay
n/an/an/an/a 5.58E+4n/an/an/an/a
Broad Institute
Curated by PubChem BioAssay
Assay Description
Broad Institute: MLPCN maternal gene expression Project ID: 2024 Keywords: Zinc finger, C. elegans, maternal gene expression, RNA-protein interac...
PubChem Bioassay (2009)
BindingDB Entry DOI: 10.7270/Q2D798VP