null
SMILES: [O-][N+](=O)c1ccccc1S(=O)(=O)n1nnc2ccccc12
InChI Key: InChIKey=GWDIYKVTXUNCMX-UHFFFAOYSA-N
Activity Spreadsheet -- Enzyme Inhibition Constant Data from BindingDB
Found 2 hits for monomerid = 52415
Trg + Lig
Ki
nM
ΔG°
kcal/mole
IC50
nM
Kd
nM
EC50/IC50
nM
koff
s-1
kon
M-1s-1
pHTemp
°C
Zinc finger protein mex-5
(Caenorhabditis elegans)
BDBM52415
(1-(2-nitrophenyl)sulfonylbenzotriazole | 1-[(2-nit...)
Show SMILES [O-][N+](=O)c1ccccc1S(=O)(=O)n1nnc2ccccc12
Show InChI InChI=1S/C12H8N4O4S/c17-16(18)11-7-3-4-8-12(11)21(19,20)15-10-6-2-1-5-9(10)13-14-15/h1-8H
PCBioAssay
n/an/an/an/a 3.00E+5n/an/an/an/a
Broad Institute
Curated by PubChem BioAssay
Assay Description
Broad Institute: MLPCN maternal gene expression Project ID: 2024 Keywords: Zinc finger, C. elegans, maternal gene expression, RNA-protein interac...
PubChem Bioassay (2009)
BindingDB Entry DOI: 10.7270/Q2D798VP
POsterior Segregation
(Caenorhabditis elegans)
BDBM52415
(1-(2-nitrophenyl)sulfonylbenzotriazole | 1-[(2-nit...)
Show SMILES [O-][N+](=O)c1ccccc1S(=O)(=O)n1nnc2ccccc12
Show InChI InChI=1S/C12H8N4O4S/c17-16(18)11-7-3-4-8-12(11)21(19,20)15-10-6-2-1-5-9(10)13-14-15/h1-8H
PCBioAssay
n/an/an/an/a 3.00E+5n/an/an/an/a
Broad Institute
Curated by PubChem BioAssay
Assay Description
Broad Institute: MLPCN maternal gene expression Project ID: 2024 Keywords: Zinc finger, C. elegans, maternal gene expression, RNA-protein interac...
PubChem Bioassay (2009)
BindingDB Entry DOI: 10.7270/Q28G8J4C