null
SMILES: Cc1cc[n+](cc1C)C1=C([N-]S(=O)(=O)c2cccs2)C(=O)c2ccccc2C1=O
InChI Key: InChIKey=NXANSMQWMSOKQV-UHFFFAOYSA-N
Activity Spreadsheet -- Enzyme Inhibition Constant Data from BindingDB
Found 2 hits for monomerid = 52467
Trg + Lig
Ki
nM
ΔG°
kcal/mole
IC50
nM
Kd
nM
EC50/IC50
nM
koff
s-1
kon
M-1s-1
pHTemp
°C
Zinc finger protein mex-5
(Caenorhabditis elegans)
BDBM52467
((3Z)-2-(3,4-dimethyl-1-pyridin-1-iumyl)-4-oxo-3-th...)
Show SMILES Cc1cc[n+](cc1C)C1=C([N-]S(=O)(=O)c2cccs2)C(=O)c2ccccc2C1=O |c:9|
Show InChI InChI=1S/C21H16N2O4S2/c1-13-9-10-23(12-14(13)2)19-18(22-29(26,27)17-8-5-11-28-17)20(24)15-6-3-4-7-16(15)21(19)25/h3-12H,1-2H3
PCBioAssay
n/an/an/an/a 3.00E+5n/an/an/an/a
Broad Institute
Curated by PubChem BioAssay
Assay Description
Broad Institute: MLPCN maternal gene expression Project ID: 2024 Keywords: Zinc finger, C. elegans, maternal gene expression, RNA-protein interac...
PubChem Bioassay (2009)
BindingDB Entry DOI: 10.7270/Q2D798VP
POsterior Segregation
(Caenorhabditis elegans)
BDBM52467
((3Z)-2-(3,4-dimethyl-1-pyridin-1-iumyl)-4-oxo-3-th...)
Show SMILES Cc1cc[n+](cc1C)C1=C([N-]S(=O)(=O)c2cccs2)C(=O)c2ccccc2C1=O |c:9|
Show InChI InChI=1S/C21H16N2O4S2/c1-13-9-10-23(12-14(13)2)19-18(22-29(26,27)17-8-5-11-28-17)20(24)15-6-3-4-7-16(15)21(19)25/h3-12H,1-2H3
PCBioAssay
n/an/an/an/a 3.00E+5n/an/an/an/a
Broad Institute
Curated by PubChem BioAssay
Assay Description
Broad Institute: MLPCN maternal gene expression Project ID: 2024 Keywords: Zinc finger, C. elegans, maternal gene expression, RNA-protein interac...
PubChem Bioassay (2009)
BindingDB Entry DOI: 10.7270/Q28G8J4C