BDBM52475 4-[[(Z)-(5-cyano-1,4-dimethyl-2,6-dioxo-3-pyridinylidene)methyl]amino]-N,N-diethylbenzenesulfonamide::4-[[(Z)-(5-cyano-1,4-dimethyl-2,6-dioxopyridin-3-ylidene)methyl]amino]-N,N-diethylbenzenesulfonamide::4-[[(Z)-(5-cyano-2,6-diketo-1,4-dimethyl-3-pyridylidene)methyl]amino]-N,N-diethyl-benzenesulfonamide::4-[[(Z)-[5-cyano-1,4-dimethyl-2,6-bis(oxidanylidene)pyridin-3-ylidene]methyl]amino]-N,N-diethyl-benzenesulfonamide::4-{[(5-cyano-1,4-dimethyl-2,6-dioxo-1,6-dihydro-3(2H)-pyridinylidene)methyl]amino}-N,N-diethylbenzenesulfonamide::MLS000705219::SMR000231228::cid_5433812
SMILES: CCN(CC)S(=O)(=O)c1ccc(NC=C2C(C)=C(C#N)C(=O)N(C)C2=O)cc1
InChI Key: InChIKey=DGYUFNSBPXAOJB-UHFFFAOYSA-N
Data: 2 EC50
Activity Spreadsheet -- Enzyme Inhibition Constant Data from BindingDB
Found 2 hits for monomerid = 52475
Trg + Lig
Ki
nM
ΔG°
kcal/mole
IC50
nM
Kd
nM
EC50/IC50
nM
koff
s-1
kon
M-1s-1
pHTemp
°C
Zinc finger protein mex-5
(Caenorhabditis elegans)
BDBM52475
(4-[[(Z)-(5-cyano-1,4-dimethyl-2,6-dioxo-3-pyridiny...)
Show SMILES CCN(CC)S(=O)(=O)c1ccc(NC=C2C(C)=C(C#N)C(=O)N(C)C2=O)cc1 |w:13.12,t:16|
Show InChI InChI=1S/C19H22N4O4S/c1-5-23(6-2)28(26,27)15-9-7-14(8-10-15)21-12-17-13(3)16(11-20)18(24)22(4)19(17)25/h7-10,12,21H,5-6H2,1-4H3
PCBioAssay
n/an/an/an/a 4.44E+4n/an/an/an/a
Broad Institute
Curated by PubChem BioAssay
Assay Description
Broad Institute: MLPCN maternal gene expression Project ID: 2024 Keywords: Zinc finger, C. elegans, maternal gene expression, RNA-protein interac...
PubChem Bioassay (2009)
BindingDB Entry DOI: 10.7270/Q2D798VP
POsterior Segregation
(Caenorhabditis elegans)
BDBM52475
(4-[[(Z)-(5-cyano-1,4-dimethyl-2,6-dioxo-3-pyridiny...)
Show SMILES CCN(CC)S(=O)(=O)c1ccc(NC=C2C(C)=C(C#N)C(=O)N(C)C2=O)cc1 |w:13.12,t:16|
Show InChI InChI=1S/C19H22N4O4S/c1-5-23(6-2)28(26,27)15-9-7-14(8-10-15)21-12-17-13(3)16(11-20)18(24)22(4)19(17)25/h7-10,12,21H,5-6H2,1-4H3
PCBioAssay
n/an/an/an/a 3.27E+4n/an/an/an/a
Broad Institute
Curated by PubChem BioAssay
Assay Description
Broad Institute: MLPCN maternal gene expression Project ID: 2024 Keywords: Zinc finger, C. elegans, maternal gene expression, RNA-protein interac...
PubChem Bioassay (2009)
BindingDB Entry DOI: 10.7270/Q28G8J4C