BDBM52484 MLS000722011::N-(4-fluorophenyl)-2-[(5E)-4-keto-5-[(E)-3-phenylprop-2-enylidene]-2-thioxo-thiazolidin-3-yl]acetamide::N-(4-fluorophenyl)-2-[(5E)-4-oxidanylidene-5-[(E)-3-phenylprop-2-enylidene]-2-sulfanylidene-1,3-thiazolidin-3-yl]ethanamide::N-(4-fluorophenyl)-2-[(5E)-4-oxo-5-[(E)-3-phenylprop-2-enylidene]-2-sulfanylidene-1,3-thiazolidin-3-yl]acetamide::N-(4-fluorophenyl)-2-[(5E)-4-oxo-5-[(E)-3-phenylprop-2-enylidene]-2-sulfanylidene-3-thiazolidinyl]acetamide::SMR000236697::cid_1619027
SMILES: Fc1ccc(NC(=O)CN2C(=S)S\C(=C\C=C\c3ccccc3)C2=O)cc1
InChI Key: InChIKey=OLWZPHZONPZLNG-AQHRCUNFSA-N
Data: 2 IC50  2 EC50
Activity Spreadsheet -- Enzyme Inhibition Constant Data from BindingDB
Found 4 hits for monomerid = 52484
Trg + Lig
Ki
nM
ΔG°
kcal/mole
IC50
nM
Kd
nM
EC50/IC50
nM
koff
s-1
kon
M-1s-1
pHTemp
°C
POsterior Segregation family member (pos-1)
(Caenorhabditis elegans)
BDBM52484
(MLS000722011 | N-(4-fluorophenyl)-2-[(5E)-4-keto-5...)
Show SMILES Fc1ccc(NC(=O)CN2C(=S)S\C(=C\C=C\c3ccccc3)C2=O)cc1
Show InChI InChI=1S/C20H15FN2O2S2/c21-15-9-11-16(12-10-15)22-18(24)13-23-19(25)17(27-20(23)26)8-4-7-14-5-2-1-3-6-14/h1-12H,13H2,(H,22,24)/b7-4+,17-8+
PCBioAssay
n/an/an/an/a 3.00E+5n/an/an/an/a
Broad Institute
Curated by PubChem BioAssay
Assay Description
Broad Institute: MLPCN maternal gene expression Project ID: 2024 Keywords: Zinc finger, C. elegans, maternal gene expression, RNA-protein interac...
PubChem Bioassay (2009)
BindingDB Entry DOI: 10.7270/Q28G8J4C
sentrin-specific protease 1
(Homo sapiens (Human))
BDBM52484
(MLS000722011 | N-(4-fluorophenyl)-2-[(5E)-4-keto-5...)
Show SMILES Fc1ccc(NC(=O)CN2C(=S)S\C(=C\C=C\c3ccccc3)C2=O)cc1
Show InChI InChI=1S/C20H15FN2O2S2/c21-15-9-11-16(12-10-15)22-18(24)13-23-19(25)17(27-20(23)26)8-4-7-14-5-2-1-3-6-14/h1-12H,13H2,(H,22,24)/b7-4+,17-8+
Reactome pathway
PCBioAssay
n/an/a 7.54E+3n/an/an/an/an/an/a
Burnham Center for Chemical Genomics
Curated by PubChem BioAssay
PubChem Bioassay (2012)
BindingDB Entry DOI: 10.7270/Q2MC8XNQ
sentrin-specific protease 1
(Homo sapiens (Human))
BDBM52484
(MLS000722011 | N-(4-fluorophenyl)-2-[(5E)-4-keto-5...)
Show SMILES Fc1ccc(NC(=O)CN2C(=S)S\C(=C\C=C\c3ccccc3)C2=O)cc1
Show InChI InChI=1S/C20H15FN2O2S2/c21-15-9-11-16(12-10-15)22-18(24)13-23-19(25)17(27-20(23)26)8-4-7-14-5-2-1-3-6-14/h1-12H,13H2,(H,22,24)/b7-4+,17-8+
Reactome pathway
PCBioAssay
n/an/a 5.21E+3n/an/an/an/an/an/a
Burnham Center for Chemical Genomics
Curated by PubChem BioAssay
PubChem Bioassay (2012)
BindingDB Entry DOI: 10.7270/Q2R49PCF
RecName: Full=Zinc finger protein mex-5
(Caenorhabditis elegans)
BDBM52484
(MLS000722011 | N-(4-fluorophenyl)-2-[(5E)-4-keto-5...)
Show SMILES Fc1ccc(NC(=O)CN2C(=S)S\C(=C\C=C\c3ccccc3)C2=O)cc1
Show InChI InChI=1S/C20H15FN2O2S2/c21-15-9-11-16(12-10-15)22-18(24)13-23-19(25)17(27-20(23)26)8-4-7-14-5-2-1-3-6-14/h1-12H,13H2,(H,22,24)/b7-4+,17-8+
PCBioAssay
n/an/an/an/a 3.00E+5n/an/an/an/a
Broad Institute
Curated by PubChem BioAssay
Assay Description
Broad Institute: MLPCN maternal gene expression Project ID: 2024 Keywords: Zinc finger, C. elegans, maternal gene expression, RNA-protein interac...
PubChem Bioassay (2009)
BindingDB Entry DOI: 10.7270/Q2D798VP