BDBM52487 3-(3-formyl-2,5-dimethyl-1-pyrrolyl)-4-methylbenzoic acid methyl ester::3-(3-formyl-2,5-dimethyl-pyrrol-1-yl)-4-methyl-benzoic acid methyl ester::MLS000680964::SMR000269233::cid_882513::methyl 3-(3-formyl-2,5-dimethyl-1H-pyrrol-1-yl)-4-methylbenzoate::methyl 3-(3-formyl-2,5-dimethylpyrrol-1-yl)-4-methylbenzoate::methyl 3-(3-methanoyl-2,5-dimethyl-pyrrol-1-yl)-4-methyl-benzoate
SMILES: COC(=O)c1ccc(C)c(c1)-n1c(C)cc(C=O)c1C
InChI Key: InChIKey=KZXQAAPFOWYLMH-UHFFFAOYSA-N
Data: 2 EC50
Activity Spreadsheet -- Enzyme Inhibition Constant Data from BindingDB
Found 2 hits for monomerid = 52487
Trg + Lig
Ki
nM
ΔG°
kcal/mole
IC50
nM
Kd
nM
EC50/IC50
nM
koff
s-1
kon
M-1s-1
pHTemp
°C
RecName: Full=Zinc finger protein mex-5
(Caenorhabditis elegans)
BDBM52487
(3-(3-formyl-2,5-dimethyl-1-pyrrolyl)-4-methylbenzo...)
Show SMILES COC(=O)c1ccc(C)c(c1)-n1c(C)cc(C=O)c1C |(9.79,-5.98,;8.46,-5.21,;8.46,-3.67,;9.79,-2.9,;7.12,-2.9,;5.79,-3.67,;4.46,-2.9,;4.46,-1.36,;3.12,-.59,;5.79,-.59,;7.12,-1.36,;5.79,.95,;4.54,1.86,;3.08,1.38,;5.02,3.32,;6.56,3.32,;7.47,4.57,;6.84,5.98,;7.04,1.86,;8.5,1.38,)|
Show InChI InChI=1S/C16H17NO3/c1-10-5-6-13(16(19)20-4)8-15(10)17-11(2)7-14(9-18)12(17)3/h5-9H,1-4H3
PCBioAssay
n/an/an/an/a 3.00E+5n/an/an/an/a
Broad Institute
Curated by PubChem BioAssay
Assay Description
Broad Institute: MLPCN maternal gene expression Project ID: 2024 Keywords: Zinc finger, C. elegans, maternal gene expression, RNA-protein interac...
PubChem Bioassay (2009)
BindingDB Entry DOI: 10.7270/Q2D798VP
POsterior Segregation family member (pos-1)
(Caenorhabditis elegans)
BDBM52487
(3-(3-formyl-2,5-dimethyl-1-pyrrolyl)-4-methylbenzo...)
Show SMILES COC(=O)c1ccc(C)c(c1)-n1c(C)cc(C=O)c1C |(9.79,-5.98,;8.46,-5.21,;8.46,-3.67,;9.79,-2.9,;7.12,-2.9,;5.79,-3.67,;4.46,-2.9,;4.46,-1.36,;3.12,-.59,;5.79,-.59,;7.12,-1.36,;5.79,.95,;4.54,1.86,;3.08,1.38,;5.02,3.32,;6.56,3.32,;7.47,4.57,;6.84,5.98,;7.04,1.86,;8.5,1.38,)|
Show InChI InChI=1S/C16H17NO3/c1-10-5-6-13(16(19)20-4)8-15(10)17-11(2)7-14(9-18)12(17)3/h5-9H,1-4H3
PCBioAssay
n/an/an/an/a 3.00E+5n/an/an/an/a
Broad Institute
Curated by PubChem BioAssay
Assay Description
Broad Institute: MLPCN maternal gene expression Project ID: 2024 Keywords: Zinc finger, C. elegans, maternal gene expression, RNA-protein interac...
PubChem Bioassay (2009)
BindingDB Entry DOI: 10.7270/Q28G8J4C