BDBM5255 (3R,4R,5S)-5-amino-3-(azonan-1-yl)-4-acetamidocyclohex-1-ene-1-carboxylic acid::C3-Cyclic Amine Carbocyclic Analogue 4f
SMILES: CC(=O)N[C@@H]1[C@@H](N)CC(=C[C@H]1N1CCCCCCCC1)C(O)=O
InChI Key: InChIKey=MWQLSGCFGLUGJI-ARFHVFGLSA-N
Data: 2 IC50
Activity Spreadsheet -- Enzyme Inhibition Constant Data from BindingDB
Found 2 hits for monomerid = 5255
Trg + Lig
Ki
nM
ΔG°
kcal/mole
IC50
nM
Kd
nM
EC50/IC50
nM
koff
s-1
kon
M-1s-1
pHTemp
°C
Neuraminidase B
(Influenza B virus (B/Lee/40))
BDBM5255
((3R,4R,5S)-5-amino-3-(azonan-1-yl)-4-acetamidocycl...)
Show SMILES CC(=O)N[C@@H]1[C@@H](N)CC(=C[C@H]1N1CCCCCCCC1)C(O)=O |r,c:8|
Show InChI InChI=1S/C17H29N3O3/c1-12(21)19-16-14(18)10-13(17(22)23)11-15(16)20-8-6-4-2-3-5-7-9-20/h11,14-16H,2-10,18H2,1H3,(H,19,21)(H,22,23)/t14-,15+,16+/m0/s1
n/an/a 41n/an/an/an/an/an/a
Gilead Sciences Inc.
Assay Description
A standard fluorimetric assay was used to measure influenza virus neuraminidase activity. The substrate 2 -(4-methylumbelliferyl)-alpha-D-acetylneura...
Bioorg Med Chem Lett 10: 1257-60 (2000)
Article DOI: 10.1016/s0960-894x(00)00214-6
BindingDB Entry DOI: 10.7270/Q22R3PWW
Neuraminidase A
(Influenza A virus (A/Puerto Rico/8/34/Mount Sinai(...)
BDBM5255
((3R,4R,5S)-5-amino-3-(azonan-1-yl)-4-acetamidocycl...)
Show SMILES CC(=O)N[C@@H]1[C@@H](N)CC(=C[C@H]1N1CCCCCCCC1)C(O)=O |r,c:8|
Show InChI InChI=1S/C17H29N3O3/c1-12(21)19-16-14(18)10-13(17(22)23)11-15(16)20-8-6-4-2-3-5-7-9-20/h11,14-16H,2-10,18H2,1H3,(H,19,21)(H,22,23)/t14-,15+,16+/m0/s1
n/an/a 75n/an/an/an/a6.537
Gilead Sciences Inc.
Assay Description
A standard fluorimetric assay was used to measure influenza virus neuraminidase activity. The substrate 2 -(4-methylumbelliferyl)-alpha-D-acetylneura...
Bioorg Med Chem Lett 10: 1257-60 (2000)
Article DOI: 10.1016/s0960-894x(00)00214-6
BindingDB Entry DOI: 10.7270/Q22R3PWW