BDBM52729 2-chloro-N-[2-[(5Z)-2,4-diketo-5-(3-pyridylmethylene)thiazolidin-3-yl]ethyl]acetamide::2-chloro-N-[2-[(5Z)-2,4-dioxo-5-(3-pyridinylmethylidene)-3-thiazolidinyl]ethyl]acetamide::2-chloro-N-[2-[(5Z)-2,4-dioxo-5-(pyridin-3-ylmethylidene)-1,3-thiazolidin-3-yl]ethyl]acetamide::MLS000517206::N-[2-[(5Z)-2,4-bis(oxidanylidene)-5-(pyridin-3-ylmethylidene)-1,3-thiazolidin-3-yl]ethyl]-2-chloranyl-ethanamide::SMR000343357::cid_2434777
SMILES: ClCC(=O)NCCN1C(=O)S\C(=C/c2cccnc2)C1=O
InChI Key: InChIKey=IKNRTONYGCGHRA-POHAHGRESA-N
Data: 7 IC50  2 EC50
Activity Spreadsheet -- Enzyme Inhibition Constant Data from BindingDB
Found 9 hits for monomerid = 52729
Trg + Lig
Ki
nM
ΔG°
kcal/mole
IC50
nM
Kd
nM
EC50/IC50
nM
koff
s-1
kon
M-1s-1
pHTemp
°C
POsterior Segregation family member (pos-1)
(Caenorhabditis elegans)
BDBM52729
(2-chloro-N-[2-[(5Z)-2,4-diketo-5-(3-pyridylmethyle...)
Show SMILES ClCC(=O)NCCN1C(=O)S\C(=C/c2cccnc2)C1=O
Show InChI InChI=1S/C13H12ClN3O3S/c14-7-11(18)16-4-5-17-12(19)10(21-13(17)20)6-9-2-1-3-15-8-9/h1-3,6,8H,4-5,7H2,(H,16,18)/b10-6-
PCBioAssay
n/an/an/an/a 3.00E+5n/an/an/an/a
Broad Institute
Curated by PubChem BioAssay
Assay Description
Broad Institute: MLPCN maternal gene expression Project ID: 2024 Keywords: Zinc finger, C. elegans, maternal gene expression, RNA-protein interac...
PubChem Bioassay (2009)
BindingDB Entry DOI: 10.7270/Q28G8J4C
RecName: Full=Zinc finger protein mex-5
(Caenorhabditis elegans)
BDBM52729
(2-chloro-N-[2-[(5Z)-2,4-diketo-5-(3-pyridylmethyle...)
Show SMILES ClCC(=O)NCCN1C(=O)S\C(=C/c2cccnc2)C1=O
Show InChI InChI=1S/C13H12ClN3O3S/c14-7-11(18)16-4-5-17-12(19)10(21-13(17)20)6-9-2-1-3-15-8-9/h1-3,6,8H,4-5,7H2,(H,16,18)/b10-6-
PCBioAssay
n/an/an/an/a 3.00E+5n/an/an/an/a
Broad Institute
Curated by PubChem BioAssay
Assay Description
Broad Institute: MLPCN maternal gene expression Project ID: 2024 Keywords: Zinc finger, C. elegans, maternal gene expression, RNA-protein interac...
PubChem Bioassay (2009)
BindingDB Entry DOI: 10.7270/Q2D798VP
glucose-6-phosphate dehydrogenase-6-phosphogluconolactonase
(Plasmodium falciparum 3D7)
BDBM52729
(2-chloro-N-[2-[(5Z)-2,4-diketo-5-(3-pyridylmethyle...)
Show SMILES ClCC(=O)NCCN1C(=O)S\C(=C/c2cccnc2)C1=O
Show InChI InChI=1S/C13H12ClN3O3S/c14-7-11(18)16-4-5-17-12(19)10(21-13(17)20)6-9-2-1-3-15-8-9/h1-3,6,8H,4-5,7H2,(H,16,18)/b10-6-
PCBioAssay
n/an/a 9.89E+3n/an/an/an/an/an/a
Burnham Center for Chemical Genomics
Curated by PubChem BioAssay
Assay Description
Data Source: Sanford-Burnham Center for Chemical Genomics (SBCCG) Source Affiliation: Sanford-Burnham Medical Research Institute (SBMRI, San Diego CA...
PubChem Bioassay (2011)
BindingDB Entry DOI: 10.7270/Q2ZS2TZG
Glucose 6-phosphate dehydrogenase (G6PD)
(Homo sapiens (Human))
BDBM52729
(2-chloro-N-[2-[(5Z)-2,4-diketo-5-(3-pyridylmethyle...)
Show SMILES ClCC(=O)NCCN1C(=O)S\C(=C/c2cccnc2)C1=O
Show InChI InChI=1S/C13H12ClN3O3S/c14-7-11(18)16-4-5-17-12(19)10(21-13(17)20)6-9-2-1-3-15-8-9/h1-3,6,8H,4-5,7H2,(H,16,18)/b10-6-
PCBioAssay
n/an/a>8.00E+4n/an/an/an/an/an/a
Burnham Center for Chemical Genomics
Curated by PubChem BioAssay
Assay Description
Data Source: Sanford-Burnham Center for Chemical Genomics (SBCCG) Source Affiliation: Sanford-Burnham Medical Research Institute (SBMRI, San Diego CA...
PubChem Bioassay (2011)
BindingDB Entry DOI: 10.7270/Q2V12389
nuclear receptor subfamily 5 group A member 2 isoform 2
(Homo sapiens (Human))
BDBM52729
(2-chloro-N-[2-[(5Z)-2,4-diketo-5-(3-pyridylmethyle...)
Show SMILES ClCC(=O)NCCN1C(=O)S\C(=C/c2cccnc2)C1=O
Show InChI InChI=1S/C13H12ClN3O3S/c14-7-11(18)16-4-5-17-12(19)10(21-13(17)20)6-9-2-1-3-15-8-9/h1-3,6,8H,4-5,7H2,(H,16,18)/b10-6-
Reactome pathway
PCBioAssay
n/an/a 8.94E+3n/an/an/an/an/an/a
The Scripps Research Institute Molecular Screening Center
Curated by PubChem BioAssay
PubChem Bioassay (2013)
BindingDB Entry DOI: 10.7270/Q22F7M18
glucose-6-phosphate dehydrogenase-6-phosphogluconolactonase
(Plasmodium falciparum 3D7)
BDBM52729
(2-chloro-N-[2-[(5Z)-2,4-diketo-5-(3-pyridylmethyle...)
Show SMILES ClCC(=O)NCCN1C(=O)S\C(=C/c2cccnc2)C1=O
Show InChI InChI=1S/C13H12ClN3O3S/c14-7-11(18)16-4-5-17-12(19)10(21-13(17)20)6-9-2-1-3-15-8-9/h1-3,6,8H,4-5,7H2,(H,16,18)/b10-6-
PCBioAssay
n/an/a>8.00E+4n/an/an/an/an/an/a
Burnham Center for Chemical Genomics
Curated by PubChem BioAssay
Assay Description
Data Source: Sanford-Burnham Center for Chemical Genomics (SBCCG) Source Affiliation: Sanford-Burnham Medical Research Institute (SBMRI, San Diego CA...
PubChem Bioassay (2011)
BindingDB Entry DOI: 10.7270/Q23T9FQ1
Thrombin
(Bos taurus (Bovine))
BDBM52729
(2-chloro-N-[2-[(5Z)-2,4-diketo-5-(3-pyridylmethyle...)
Show SMILES ClCC(=O)NCCN1C(=O)S\C(=C/c2cccnc2)C1=O
Show InChI InChI=1S/C13H12ClN3O3S/c14-7-11(18)16-4-5-17-12(19)10(21-13(17)20)6-9-2-1-3-15-8-9/h1-3,6,8H,4-5,7H2,(H,16,18)/b10-6-
PCBioAssay
n/an/a>1.00E+5n/an/an/an/an/an/a
Burnham Center for Chemical Genomics
Curated by PubChem BioAssay
Assay Description
Data Source: Sanford-Burnham Center for Chemical Genomics (SBCCG) Source Affiliation: Sanford Burnham Medical Research Institute (SBMRI, La Jolla, CA...
PubChem Bioassay (2012)
BindingDB Entry DOI: 10.7270/Q2JM286J
26S Proteasome regulatory subunit Rpn11 (Rpn11)
(Homo sapiens (Human))
BDBM52729
(2-chloro-N-[2-[(5Z)-2,4-diketo-5-(3-pyridylmethyle...)
Show SMILES ClCC(=O)NCCN1C(=O)S\C(=C/c2cccnc2)C1=O
Show InChI InChI=1S/C13H12ClN3O3S/c14-7-11(18)16-4-5-17-12(19)10(21-13(17)20)6-9-2-1-3-15-8-9/h1-3,6,8H,4-5,7H2,(H,16,18)/b10-6-
PCBioAssay
n/an/a 7.21E+3n/an/an/an/an/an/a
Burnham Center for Chemical Genomics
Curated by PubChem BioAssay
Assay Description
Data Source: Sanford-Burnham Center for Chemical Genomics (SBCCG) Source Affiliation: Sanford Burnham Medical Research Institute (SBMRI, La Jolla, CA...
PubChem Bioassay (2012)
BindingDB Entry DOI: 10.7270/Q2PC30Z9
glucose-6-phosphate dehydrogenase-6-phosphogluconolactonase
(Plasmodium falciparum 3D7)
BDBM52729
(2-chloro-N-[2-[(5Z)-2,4-diketo-5-(3-pyridylmethyle...)
Show SMILES ClCC(=O)NCCN1C(=O)S\C(=C/c2cccnc2)C1=O
Show InChI InChI=1S/C13H12ClN3O3S/c14-7-11(18)16-4-5-17-12(19)10(21-13(17)20)6-9-2-1-3-15-8-9/h1-3,6,8H,4-5,7H2,(H,16,18)/b10-6-
PCBioAssay
n/an/a>8.00E+4n/an/an/an/an/an/a
Burnham Center for Chemical Genomics
Curated by PubChem BioAssay
Assay Description
Data Source: Sanford-Burnham Center for Chemical Genomics (SBCCG) Source Affiliation: Sanford-Burnham Medical Research Institute (SBMRI, San Diego CA...
PubChem Bioassay (2011)
BindingDB Entry DOI: 10.7270/Q27H1H3W