BDBM53421 4-Cyclohexyl-2-phenyl-quinazoline::4-cyclohexyl-2-phenyl-quinazoline::4-cyclohexyl-2-phenylquinazoline::MLS001049987::Menadione, 11::SMR000469604::cid_23640938
SMILES: C1CCC(CC1)c1nc(nc2ccccc12)-c1ccccc1
InChI Key: InChIKey=PZXJVBUHBNWQIT-UHFFFAOYSA-N
Data: 4 IC50  1 EC50
Activity Spreadsheet -- Enzyme Inhibition Constant Data from BindingDB
Found 5 hits for monomerid = 53421
Trg + Lig
Ki
nM
ΔG°
kcal/mole
IC50
nM
Kd
nM
EC50/IC50
nM
koff
s-1
kon
M-1s-1
pHTemp
°C
Ubiquitin carboxyl-terminal hydrolase isozyme L1 (UCH-L1)
(Mus musculus (Mouse))
BDBM53421
(4-Cyclohexyl-2-phenyl-quinazoline | 4-cyclohexyl-2...)
Show SMILES C1CCC(CC1)c1nc(nc2ccccc12)-c1ccccc1
Show InChI InChI=1S/C20H20N2/c1-3-9-15(10-4-1)19-17-13-7-8-14-18(17)21-20(22-19)16-11-5-2-6-12-16/h2,5-8,11-15H,1,3-4,9-10H2
n/an/a 7.50E+4n/an/an/an/a7.625
Brigham and Women's Hospital
Assay Description
Inhibition activity and selectivity for UCH-L1 and UCH-L3.
Chem Biol 10: 837-46 (2003)
Article DOI: 10.1016/j.chembiol.2003.08.010
BindingDB Entry DOI: 10.7270/Q20Z71P9
Ubiquitin carboxyl-terminal hydrolase isozyme L3 (UCH-L3)
(Mus musculus (Mouse))
BDBM53421
(4-Cyclohexyl-2-phenyl-quinazoline | 4-cyclohexyl-2...)
Show SMILES C1CCC(CC1)c1nc(nc2ccccc12)-c1ccccc1
Show InChI InChI=1S/C20H20N2/c1-3-9-15(10-4-1)19-17-13-7-8-14-18(17)21-20(22-19)16-11-5-2-6-12-16/h2,5-8,11-15H,1,3-4,9-10H2
n/an/a 600n/an/an/an/a7.625
Brigham and Women's Hospital
Assay Description
Inhibition activity and selectivity for UCH-L1 and UCH-L3.
Chem Biol 10: 837-46 (2003)
Article DOI: 10.1016/j.chembiol.2003.08.010
BindingDB Entry DOI: 10.7270/Q20Z71P9
Ubiquitin C-terminal Hydrolase L3 (UCH-L3)
(Homo sapiens (Human))
BDBM53421
(4-Cyclohexyl-2-phenyl-quinazoline | 4-cyclohexyl-2...)
Show SMILES C1CCC(CC1)c1nc(nc2ccccc12)-c1ccccc1
Show InChI InChI=1S/C20H20N2/c1-3-9-15(10-4-1)19-17-13-7-8-14-18(17)21-20(22-19)16-11-5-2-6-12-16/h2,5-8,11-15H,1,3-4,9-10H2
n/an/a 600n/an/an/an/an/an/a
Institute for Biomedical Research
Curated by ChEMBL
Assay Description
Inhibition of UCHL3 in human H1299 cells
Nat Chem Biol 3: 697-705 (2007)
Article DOI: 10.1038/nchembio.2007.43
BindingDB Entry DOI: 10.7270/Q2KW5G7P
Ubiquitin carboxyl-terminal hydrolase isozyme L1
(Homo sapiens (Human))
BDBM53421
(4-Cyclohexyl-2-phenyl-quinazoline | 4-cyclohexyl-2...)
Show SMILES C1CCC(CC1)c1nc(nc2ccccc12)-c1ccccc1
Show InChI InChI=1S/C20H20N2/c1-3-9-15(10-4-1)19-17-13-7-8-14-18(17)21-20(22-19)16-11-5-2-6-12-16/h2,5-8,11-15H,1,3-4,9-10H2
n/an/a 7.50E+4n/an/an/an/an/an/a
Institute for Biomedical Research
Curated by ChEMBL
Assay Description
Inhibition of UCHL1 in human H1299 cells
Nat Chem Biol 3: 697-705 (2007)
Article DOI: 10.1038/nchembio.2007.43
BindingDB Entry DOI: 10.7270/Q2KW5G7P
streptokinase A precursor
(Streptococcus pyogenes M1 GAS)
BDBM53421
(4-Cyclohexyl-2-phenyl-quinazoline | 4-cyclohexyl-2...)
Show SMILES C1CCC(CC1)c1nc(nc2ccccc12)-c1ccccc1
Show InChI InChI=1S/C20H20N2/c1-3-9-15(10-4-1)19-17-13-7-8-14-18(17)21-20(22-19)16-11-5-2-6-12-16/h2,5-8,11-15H,1,3-4,9-10H2
PCBioAssay
n/an/an/an/a 2.16E+4n/an/an/an/a
Broad Institute
Curated by PubChem BioAssay
Assay Description
Keywords: Group A streptococcus, GAS, streptokinase, expression, virulence, inhibition, dose response, EC50 Assay Overview: The goal of this assa...
PubChem Bioassay (2009)
BindingDB Entry DOI: 10.7270/Q2736PBV