BDBM53489 MLS000030459::SMR000039328::cid_658507
SMILES: NC(=O)CSc1nnc2n(-c3ccccc3)c(=O)c3c4CCCCCc4sc3n12
InChI Key: InChIKey=ILNZPCHQXNINAG-UHFFFAOYSA-N
Data: 3 IC50
Activity Spreadsheet -- Enzyme Inhibition Constant Data from BindingDB
Found 3 hits for monomerid = 53489
Trg + Lig
Ki
nM
ΔG°
kcal/mole
IC50
nM
Kd
nM
EC50/IC50
nM
koff
s-1
kon
M-1s-1
pHTemp
°C
Hematopoietic protein-tyrosine phosphatase (HEPTP)
(Homo sapiens (Human))
BDBM53489
(MLS000030459 | SMR000039328 | cid_658507)
Show SMILES NC(=O)CSc1nnc2n(-c3ccccc3)c(=O)c3c4CCCCCc4sc3n12
Show InChI InChI=1S/C20H19N5O2S2/c21-15(26)11-28-20-23-22-19-24(12-7-3-1-4-8-12)17(27)16-13-9-5-2-6-10-14(13)29-18(16)25(19)20/h1,3-4,7-8H,2,5-6,9-11H2,(H2,21,26)
PCBioAssay
n/an/a 2.54E+3n/an/an/an/an/an/a
Burnham Center for Chemical Genomics
Curated by PubChem BioAssay
Assay Description
Data Source: Sanford-Burnham Center for Chemical Genomics (SBCCG) Source Affiliation: Sanford-Burnham Medical Research Institute (SBMRI, San Diego, C...
PubChem Bioassay (2008)
BindingDB Entry DOI: 10.7270/Q2RJ4GWX
Prion protein
(Homo sapiens (Human))
BDBM53489
(MLS000030459 | SMR000039328 | cid_658507)
Show SMILES NC(=O)CSc1nnc2n(-c3ccccc3)c(=O)c3c4CCCCCc4sc3n12
Show InChI InChI=1S/C20H19N5O2S2/c21-15(26)11-28-20-23-22-19-24(12-7-3-1-4-8-12)17(27)16-13-9-5-2-6-10-14(13)29-18(16)25(19)20/h1,3-4,7-8H,2,5-6,9-11H2,(H2,21,26)
NCI pathway
Reactome pathway
PCBioAssay
n/an/a 4.66E+3n/an/an/an/an/an/a
The Scripps Research Institute Molecular Screening Center
Curated by PubChem BioAssay
Assay Description
Source (MLPCN Center Name): The Scripps Research Institute Molecular Screening Center (SRIMSC) Affiliation: The Scripps Research Institute, TSRI Assa...
PubChem Bioassay (2014)
BindingDB Entry DOI: 10.7270/Q2HM573M
MKP-3
(Rattus norvegicus)
BDBM53489
(MLS000030459 | SMR000039328 | cid_658507)
Show SMILES NC(=O)CSc1nnc2n(-c3ccccc3)c(=O)c3c4CCCCCc4sc3n12
Show InChI InChI=1S/C20H19N5O2S2/c21-15(26)11-28-20-23-22-19-24(12-7-3-1-4-8-12)17(27)16-13-9-5-2-6-10-14(13)29-18(16)25(19)20/h1,3-4,7-8H,2,5-6,9-11H2,(H2,21,26)
Reactome pathway
PCBioAssay
n/an/a 1.00E+4n/an/an/an/an/an/a
Sanford-Burnham Center for Chemical Genomics
Curated by PubChem BioAssay
Assay Description
Data Source: Sanford-Burnham Center for Chemical Genomics (SBCCG) Source Affiliation: Sanford-Burnham Medical Research Institute (SBMRI, San Diego, C...
PubChem Bioassay (2009)
BindingDB Entry DOI: 10.7270/Q2W66J6B