BDBM5409 4-(2-{4-[3-(thiophen-3-yl)pyrazolo[1,5-a]pyrimidin-6-yl]phenoxy}ethyl)morpholine::pyrazolo[1,5-a]pyrimidine 4a
SMILES: C(CN1CCOCC1)Oc1ccc(cc1)-c1cnc2c(cnn2c1)-c1ccsc1
InChI Key: InChIKey=YUAOWJBCURIMGN-UHFFFAOYSA-N
Data: 3 IC50
Activity Spreadsheet -- Enzyme Inhibition Constant Data from BindingDB
Found 3 hits for monomerid = 5409
Trg + Lig
Ki
nM
ΔG°
kcal/mole
IC50
nM
Kd
nM
EC50/IC50
nM
koff
s-1
kon
M-1s-1
pHTemp
°C
Vascular endothelial growth factor receptor 2
(Homo sapiens (Human))
BDBM5409
(4-(2-{4-[3-(thiophen-3-yl)pyrazolo[1,5-a]pyrimidin...)
Show SMILES C(CN1CCOCC1)Oc1ccc(cc1)-c1cnc2c(cnn2c1)-c1ccsc1
Show InChI InChI=1S/C22H22N4O2S/c1-3-20(28-11-8-25-6-9-27-10-7-25)4-2-17(1)19-13-23-22-21(14-24-26(22)15-19)18-5-12-29-16-18/h1-5,12-16H,6-11H2
NCI pathway
Reactome pathway
n/an/a 4n/an/an/an/a7.422
Merck Research Laboratories
Assay Description
Activated KDR was incubated with 25 uM/10 uCi of [gamma-33P] ATP, poly-Glu/Tyr, and inhibitors in kinase buffer for 15 min at 22 °C. The reactio...
Bioorg Med Chem Lett 12: 3537-41 (2002)
Article DOI: 10.1016/s0960-894x(02)00827-2
BindingDB Entry DOI: 10.7270/Q2S75DHR
Vascular endothelial growth factor receptor 2
(Homo sapiens (Human))
BDBM5409
(4-(2-{4-[3-(thiophen-3-yl)pyrazolo[1,5-a]pyrimidin...)
Show SMILES C(CN1CCOCC1)Oc1ccc(cc1)-c1cnc2c(cnn2c1)-c1ccsc1
Show InChI InChI=1S/C22H22N4O2S/c1-3-20(28-11-8-25-6-9-27-10-7-25)4-2-17(1)19-13-23-22-21(14-24-26(22)15-19)18-5-12-29-16-18/h1-5,12-16H,6-11H2
NCI pathway
Reactome pathway
n/an/a 4n/an/an/an/an/an/a
University of KwaZulu-Natal
Curated by ChEMBL
Assay Description
Inhibition of recombinant human GST-fused KDR kinase expressed in insect Sf21 cells using poly-Glu/Tyr (4:1) peptide as substrate
Eur J Med Chem 126: 298-352 (2017)
BindingDB Entry DOI: 10.7270/Q2S184RN
Vascular endothelial growth factor receptor 2
(Homo sapiens (Human))
BDBM5409
(4-(2-{4-[3-(thiophen-3-yl)pyrazolo[1,5-a]pyrimidin...)
Show SMILES C(CN1CCOCC1)Oc1ccc(cc1)-c1cnc2c(cnn2c1)-c1ccsc1
Show InChI InChI=1S/C22H22N4O2S/c1-3-20(28-11-8-25-6-9-27-10-7-25)4-2-17(1)19-13-23-22-21(14-24-26(22)15-19)18-5-12-29-16-18/h1-5,12-16H,6-11H2
NCI pathway
Reactome pathway
n/an/a 22n/an/an/an/an/an/a
University of KwaZulu-Natal
Curated by ChEMBL
Assay Description
Inhibition of recombinant human GST-fused KDR kinase expressed in insect Sf21 cells using poly-Glu/Tyr (4:1) peptide as substrate by ECMA
Eur J Med Chem 126: 298-352 (2017)
BindingDB Entry DOI: 10.7270/Q2S184RN