BDBM54188 1-(3-methylphenyl)-3-[(Z)-(2-oxidanylidene-1-prop-2-enyl-indol-3-ylidene)amino]thiourea::1-(3-methylphenyl)-3-[(Z)-(2-oxo-1-prop-2-enyl-3-indolylidene)amino]thiourea::1-(3-methylphenyl)-3-[(Z)-(2-oxo-1-prop-2-enylindol-3-ylidene)amino]thiourea::1-[(Z)-(1-allyl-2-keto-indolin-3-ylidene)amino]-3-(m-tolyl)thiourea::MLS000522059::SMR000132467::cid_6296094
SMILES: Cc1cccc(NC(=S)NN=C2C(=O)N(CC=C)c3ccccc23)c1
InChI Key: InChIKey=MXOMWRVTXOTHJQ-UHFFFAOYSA-N
Data: 4 IC50  1 EC50
Activity Spreadsheet -- Enzyme Inhibition Constant Data from BindingDB
Found 5 hits for monomerid = 54188
Trg + Lig
Ki
nM
ΔG°
kcal/mole
IC50
nM
Kd
nM
EC50/IC50
nM
koff
s-1
kon
M-1s-1
pHTemp
°C
nucleotide-binding oligomerization domain containing 2
(Homo sapiens (Human))
BDBM54188
(1-(3-methylphenyl)-3-[(Z)-(2-oxidanylidene-1-prop-...)
Show SMILES Cc1cccc(NC(=S)NN=C2C(=O)N(CC=C)c3ccccc23)c1 |w:10.9|
Show InChI InChI=1S/C19H18N4OS/c1-3-11-23-16-10-5-4-9-15(16)17(18(23)24)21-22-19(25)20-14-8-6-7-13(2)12-14/h3-10,12H,1,11H2,2H3,(H2,20,22,25)
Reactome pathway
PCBioAssay
n/an/a 1.18E+3n/an/an/an/an/an/a
Burnham Center for Chemical Genomics
Curated by PubChem BioAssay
Assay Description
Data Source: Sanford-Burnham Center for Chemical Genomics (SBCCG) Source Affiliation: Sanford-Burnham Medical Research Institute (SBMRI, San Diego, C...
PubChem Bioassay (2010)
BindingDB Entry DOI: 10.7270/Q23R0R8T
nucleotide-binding oligomerization domain containing 1
(Homo sapiens (Human))
BDBM54188
(1-(3-methylphenyl)-3-[(Z)-(2-oxidanylidene-1-prop-...)
Show SMILES Cc1cccc(NC(=S)NN=C2C(=O)N(CC=C)c3ccccc23)c1 |w:10.9|
Show InChI InChI=1S/C19H18N4OS/c1-3-11-23-16-10-5-4-9-15(16)17(18(23)24)21-22-19(25)20-14-8-6-7-13(2)12-14/h3-10,12H,1,11H2,2H3,(H2,20,22,25)
Reactome pathway
PCBioAssay
n/an/an/an/a 1.09E+3n/an/an/an/a
Burnham Center for Chemical Genomics
Curated by PubChem BioAssay
Assay Description
Data Source: Sanford-Burnham Center for Chemical Genomics (SBCCG) Source Affiliation: Sanford-Burnham Medical Research Institute (SBMRI, San Diego, C...
PubChem Bioassay (2010)
BindingDB Entry DOI: 10.7270/Q2CN72C0
Protein Wnt-3a
(Mus musculus)
BDBM54188
(1-(3-methylphenyl)-3-[(Z)-(2-oxidanylidene-1-prop-...)
Show SMILES Cc1cccc(NC(=S)NN=C2C(=O)N(CC=C)c3ccccc23)c1 |w:10.9|
Show InChI InChI=1S/C19H18N4OS/c1-3-11-23-16-10-5-4-9-15(16)17(18(23)24)21-22-19(25)20-14-8-6-7-13(2)12-14/h3-10,12H,1,11H2,2H3,(H2,20,22,25)
Reactome pathway
PCBioAssay
n/an/a 2.92E+4n/an/an/an/an/an/a
Burnham Center for Chemical Genomics
Curated by PubChem BioAssay
PubChem Bioassay (2012)
BindingDB Entry DOI: 10.7270/Q25B012X
Zinc finger protein GLI1
(Mus musculus)
BDBM54188
(1-(3-methylphenyl)-3-[(Z)-(2-oxidanylidene-1-prop-...)
Show SMILES Cc1cccc(NC(=S)NN=C2C(=O)N(CC=C)c3ccccc23)c1 |w:10.9|
Show InChI InChI=1S/C19H18N4OS/c1-3-11-23-16-10-5-4-9-15(16)17(18(23)24)21-22-19(25)20-14-8-6-7-13(2)12-14/h3-10,12H,1,11H2,2H3,(H2,20,22,25)
PCBioAssay
n/an/a 8.58E+3n/an/an/an/an/an/a
Burnham Center for Chemical Genomics
Curated by PubChem BioAssay
Assay Description
Data Source: Sanford-Burnham Center for Chemical Genomics (SBCCG) Source Affiliation: Sanford-Burnham Medical Research Institute (SBMRI, San Diego, C...
PubChem Bioassay (2012)
BindingDB Entry DOI: 10.7270/Q2862F26
Tumor necrosis factor
(Homo sapiens (Human))
BDBM54188
(1-(3-methylphenyl)-3-[(Z)-(2-oxidanylidene-1-prop-...)
Show SMILES Cc1cccc(NC(=S)NN=C2C(=O)N(CC=C)c3ccccc23)c1 |w:10.9|
Show InChI InChI=1S/C19H18N4OS/c1-3-11-23-16-10-5-4-9-15(16)17(18(23)24)21-22-19(25)20-14-8-6-7-13(2)12-14/h3-10,12H,1,11H2,2H3,(H2,20,22,25)
Reactome pathway
PCBioAssay
n/an/a 2.97E+3n/an/an/an/an/an/a
Burnham Center for Chemical Genomics
Curated by PubChem BioAssay
Assay Description
Data Source: Sanford-Burnham Center for Chemical Genomics (SBCCG) Source Affiliation: Sanford-Burnham Medical Research Institute (SBMRI, San Diego, C...
PubChem Bioassay (2010)
BindingDB Entry DOI: 10.7270/Q25M6443