BDBM54424 (2E,6E)-4-tert-butyl-2,6-bis(3,4,5-trimethoxybenzylidene)cyclohexanone::(2E,6E)-4-tert-butyl-2,6-bis[(3,4,5-trimethoxyphenyl)methylidene]-1-cyclohexanone::(2E,6E)-4-tert-butyl-2,6-bis[(3,4,5-trimethoxyphenyl)methylidene]cyclohexan-1-one::MLS001196977::SMR000555660::cid_5322302
SMILES: COc1cc(\C=C2/CC(C\C(=C/c3cc(OC)c(OC)c(OC)c3)C2=O)C(C)(C)C)cc(OC)c1OC
InChI Key: InChIKey=MVFZFKNUNYNNOG-CLVAPQHMSA-N
Data: 5 IC50  1 EC50
Activity Spreadsheet -- Enzyme Inhibition Constant Data from BindingDB
Found 6 hits for monomerid = 54424
Trg + Lig
Ki
nM
ΔG°
kcal/mole
IC50
nM
Kd
nM
EC50/IC50
nM
koff
s-1
kon
M-1s-1
pHTemp
°C
nucleotide-binding oligomerization domain containing 2
(Homo sapiens (Human))
BDBM54424
((2E,6E)-4-tert-butyl-2,6-bis(3,4,5-trimethoxybenzy...)
Show SMILES COc1cc(\C=C2/CC(C\C(=C/c3cc(OC)c(OC)c(OC)c3)C2=O)C(C)(C)C)cc(OC)c1OC
Show InChI InChI=1S/C30H38O7/c1-30(2,3)22-16-20(10-18-12-23(32-4)28(36-8)24(13-18)33-5)27(31)21(17-22)11-19-14-25(34-6)29(37-9)26(15-19)35-7/h10-15,22H,16-17H2,1-9H3/b20-10+,21-11+
Reactome pathway
PCBioAssay
n/an/a 4.98E+3n/an/an/an/an/an/a
Burnham Center for Chemical Genomics
Curated by PubChem BioAssay
Assay Description
Data Source: Sanford-Burnham Center for Chemical Genomics (SBCCG) Source Affiliation: Sanford-Burnham Medical Research Institute (SBMRI, San Diego, C...
PubChem Bioassay (2010)
BindingDB Entry DOI: 10.7270/Q23R0R8T
nucleotide-binding oligomerization domain containing 1
(Homo sapiens (Human))
BDBM54424
((2E,6E)-4-tert-butyl-2,6-bis(3,4,5-trimethoxybenzy...)
Show SMILES COc1cc(\C=C2/CC(C\C(=C/c3cc(OC)c(OC)c(OC)c3)C2=O)C(C)(C)C)cc(OC)c1OC
Show InChI InChI=1S/C30H38O7/c1-30(2,3)22-16-20(10-18-12-23(32-4)28(36-8)24(13-18)33-5)27(31)21(17-22)11-19-14-25(34-6)29(37-9)26(15-19)35-7/h10-15,22H,16-17H2,1-9H3/b20-10+,21-11+
Reactome pathway
PCBioAssay
n/an/an/an/a 5.25E+3n/an/an/an/a
Burnham Center for Chemical Genomics
Curated by PubChem BioAssay
Assay Description
Data Source: Sanford-Burnham Center for Chemical Genomics (SBCCG) Source Affiliation: Sanford-Burnham Medical Research Institute (SBMRI, San Diego, C...
PubChem Bioassay (2010)
BindingDB Entry DOI: 10.7270/Q2CN72C0
Nuclear receptor coactivator 1
(Homo sapiens (Human))
BDBM54424
((2E,6E)-4-tert-butyl-2,6-bis(3,4,5-trimethoxybenzy...)
Show SMILES COc1cc(\C=C2/CC(C\C(=C/c3cc(OC)c(OC)c(OC)c3)C2=O)C(C)(C)C)cc(OC)c1OC
Show InChI InChI=1S/C30H38O7/c1-30(2,3)22-16-20(10-18-12-23(32-4)28(36-8)24(13-18)33-5)27(31)21(17-22)11-19-14-25(34-6)29(37-9)26(15-19)35-7/h10-15,22H,16-17H2,1-9H3/b20-10+,21-11+
Reactome pathway
PCBioAssay
n/an/a>3.59E+4n/an/an/an/an/an/a
The Scripps Research Institute Molecular Screening Center
Curated by PubChem BioAssay
Assay Description
Source (MLPCN Center Name): The Scripps Research Institute Molecular Screening Center (SRIMSC) Affiliation: The Scripps Research Institute, TSRI Assa...
PubChem Bioassay (2012)
BindingDB Entry DOI: 10.7270/Q28914F2
nuclear receptor coactivator 3 isoform a
(Homo sapiens (Human))
BDBM54424
((2E,6E)-4-tert-butyl-2,6-bis(3,4,5-trimethoxybenzy...)
Show SMILES COc1cc(\C=C2/CC(C\C(=C/c3cc(OC)c(OC)c(OC)c3)C2=O)C(C)(C)C)cc(OC)c1OC
Show InChI InChI=1S/C30H38O7/c1-30(2,3)22-16-20(10-18-12-23(32-4)28(36-8)24(13-18)33-5)27(31)21(17-22)11-19-14-25(34-6)29(37-9)26(15-19)35-7/h10-15,22H,16-17H2,1-9H3/b20-10+,21-11+
Reactome pathway
PCBioAssay
n/an/a>3.59E+4n/an/an/an/an/an/a
The Scripps Research Institute Molecular Screening Center
Curated by PubChem BioAssay
Assay Description
Source (MLPCN Center Name): The Scripps Research Institute Molecular Screening Center (SRIMSC) Affiliation: The Scripps Research Institute, TSRI Assa...
PubChem Bioassay (2012)
BindingDB Entry DOI: 10.7270/Q2HT2MXV
Alpha trans-inducing protein (VP16)
(Human herpesvirus 1 (strain 17) (HHV-1) (Human her...)
BDBM54424
((2E,6E)-4-tert-butyl-2,6-bis(3,4,5-trimethoxybenzy...)
Show SMILES COc1cc(\C=C2/CC(C\C(=C/c3cc(OC)c(OC)c(OC)c3)C2=O)C(C)(C)C)cc(OC)c1OC
Show InChI InChI=1S/C30H38O7/c1-30(2,3)22-16-20(10-18-12-23(32-4)28(36-8)24(13-18)33-5)27(31)21(17-22)11-19-14-25(34-6)29(37-9)26(15-19)35-7/h10-15,22H,16-17H2,1-9H3/b20-10+,21-11+
PCBioAssay
n/an/a 4.47E+3n/an/an/an/an/an/a
The Scripps Research Institute Molecular Screening Center
Curated by PubChem BioAssay
Assay Description
Source (MLPCN Center Name): The Scripps Research Institute Molecular Screening Center (SRIMSC) Affiliation: The Scripps Research Institute, TSRI Assa...
PubChem Bioassay (2012)
BindingDB Entry DOI: 10.7270/Q2D21W6V
Tumor necrosis factor
(Homo sapiens (Human))
BDBM54424
((2E,6E)-4-tert-butyl-2,6-bis(3,4,5-trimethoxybenzy...)
Show SMILES COc1cc(\C=C2/CC(C\C(=C/c3cc(OC)c(OC)c(OC)c3)C2=O)C(C)(C)C)cc(OC)c1OC
Show InChI InChI=1S/C30H38O7/c1-30(2,3)22-16-20(10-18-12-23(32-4)28(36-8)24(13-18)33-5)27(31)21(17-22)11-19-14-25(34-6)29(37-9)26(15-19)35-7/h10-15,22H,16-17H2,1-9H3/b20-10+,21-11+
Reactome pathway
PCBioAssay
n/an/a 4.76E+3n/an/an/an/an/an/a
Burnham Center for Chemical Genomics
Curated by PubChem BioAssay
Assay Description
Data Source: Sanford-Burnham Center for Chemical Genomics (SBCCG) Source Affiliation: Sanford-Burnham Medical Research Institute (SBMRI, San Diego, C...
PubChem Bioassay (2010)
BindingDB Entry DOI: 10.7270/Q25M6443