BDBM5470 6-methoxy-9H-purin-2-amine::CHEMBL226395::O6-Substituted Guanine Deriv. 1
SMILES: COc1nc(N)nc2nc[nH]c12
InChI Key: InChIKey=BXJHWYVXLGLDMZ-UHFFFAOYSA-N
Data: 4 IC50
PDB links: 2 PDB IDs match this monomer. 12 PDB IDs contain this monomer as substructures. 12 PDB IDs contain inhibitors having a similarity of 90% to this monomer.
Activity Spreadsheet -- Enzyme Inhibition Constant Data from BindingDB
Found 6 hits for monomerid = 5470
Trg + Lig
Ki
nM
ΔG°
kcal/mole
IC50
nM
Kd
nM
EC50/IC50
nM
koff
s-1
kon
M-1s-1
pHTemp
°C
Cyclin-Dependent Kinase 1 (CDK1)
(Marthasterias glacialis (starfish))
BDBM5470
(6-methoxy-9H-purin-2-amine | CHEMBL226395 | O6-Sub...)
Show SMILES COc1nc(N)nc2nc[nH]c12
Show InChI InChI=1S/C6H7N5O/c1-12-5-3-4(9-2-8-3)10-6(7)11-5/h2H,1H3,(H3,7,8,9,10,11)
n/an/an/an/an/an/an/an/an/a
University of Newcastle
Assay Description
The enzyme was assayed with substrate histone H1 in the presence of 12.5 uM ATP/[gamma-32P] ATP. IC50 is the inhibitor concentration, which inhibits ...
J Med Chem 45: 3381-93 (2002)
Article DOI: 10.1021/jm020056z
BindingDB Entry DOI: 10.7270/Q2891424
Cyclin-Dependent Kinase 2 (CDK2)
(Homo sapiens (Human))
BDBM5470
(6-methoxy-9H-purin-2-amine | CHEMBL226395 | O6-Sub...)
Show SMILES COc1nc(N)nc2nc[nH]c12
Show InChI InChI=1S/C6H7N5O/c1-12-5-3-4(9-2-8-3)10-6(7)11-5/h2H,1H3,(H3,7,8,9,10,11)
NCI pathway
Reactome pathway
n/an/an/an/an/an/an/an/an/a
University of Newcastle
Assay Description
The enzyme was assayed with substrate histone H1 in the presence of 12.5 uM ATP/[gamma-32P] ATP. IC50 is the inhibitor concentration, which inhibits ...
J Med Chem 45: 3381-93 (2002)
Article DOI: 10.1021/jm020056z
BindingDB Entry DOI: 10.7270/Q2891424
Cyclin-dependent kinase 2
(Homo sapiens (Human))
BDBM5470
(6-methoxy-9H-purin-2-amine | CHEMBL226395 | O6-Sub...)
Show SMILES COc1nc(N)nc2nc[nH]c12
Show InChI InChI=1S/C6H7N5O/c1-12-5-3-4(9-2-8-3)10-6(7)11-5/h2H,1H3,(H3,7,8,9,10,11)
NCI pathway
Reactome pathway
n/an/a>1.00E+5n/an/an/an/an/an/a
Newcastle University
Curated by ChEMBL
Assay Description
In vitro inhibitory concentration against angiotensin-converting enzyme
J Med Chem 60: 1746-1767 (2017)
Article DOI: 10.1021/acs.jmedchem.6b01254
BindingDB Entry DOI: 10.7270/Q2833V86
6-O-methylguanine-DNA methyltransferase
(Homo sapiens (Human))
BDBM5470
(6-methoxy-9H-purin-2-amine | CHEMBL226395 | O6-Sub...)
Show SMILES COc1nc(N)nc2nc[nH]c12
Show InChI InChI=1S/C6H7N5O/c1-12-5-3-4(9-2-8-3)10-6(7)11-5/h2H,1H3,(H3,7,8,9,10,11)
Reactome pathway
n/an/a 4.28E+5n/an/an/an/an/an/a
The University
Curated by ChEMBL
Assay Description
Inhibition of AGT activity to 50% of control rate in HT-29 cell extract
J Med Chem 43: 4071-83 (2000)
BindingDB Entry DOI: 10.7270/Q2RF5T8B
Xanthine dehydrogenase/oxidase
(Homo sapiens (Human))
BDBM5470
(6-methoxy-9H-purin-2-amine | CHEMBL226395 | O6-Sub...)
Show SMILES COc1nc(N)nc2nc[nH]c12
Show InChI InChI=1S/C6H7N5O/c1-12-5-3-4(9-2-8-3)10-6(7)11-5/h2H,1H3,(H3,7,8,9,10,11)
n/an/a>2.00E+5n/an/an/an/an/an/a
Institute of Biological Chemistry and the Genomics Research Center
Curated by ChEMBL
Assay Description
Inhibition of human xanthine oxidase
Bioorg Med Chem 15: 3450-6 (2007)
Article DOI: 10.1016/j.bmc.2007.03.010
BindingDB Entry DOI: 10.7270/Q2WD407G
6-O-methylguanine-DNA methyltransferase
(Homo sapiens (Human))
BDBM5470
(6-methoxy-9H-purin-2-amine | CHEMBL226395 | O6-Sub...)
Show SMILES COc1nc(N)nc2nc[nH]c12
Show InChI InChI=1S/C6H7N5O/c1-12-5-3-4(9-2-8-3)10-6(7)11-5/h2H,1H3,(H3,7,8,9,10,11)
Reactome pathway
n/an/a 2.48E+5n/an/an/an/an/an/a
The University
Curated by ChEMBL
Assay Description
concentration required to reduce AGT activity to 50% of control rate in intact HT-29 human colorectal carcinoma cells
J Med Chem 43: 4071-83 (2000)
BindingDB Entry DOI: 10.7270/Q2RF5T8B