BDBM54731 MLS000580536::N-[3-(1H-benzimidazol-2-yl)phenyl]-2-(4-chlorophenyl)sulfanyl-ethanamide::N-[3-(1H-benzimidazol-2-yl)phenyl]-2-(4-chlorophenyl)sulfanylacetamide::N-[3-(1H-benzimidazol-2-yl)phenyl]-2-[(4-chlorophenyl)thio]acetamide::SMR000199424::cid_1288833
SMILES: Clc1ccc(SCC(=O)Nc2cccc(c2)-c2nc3ccccc3[nH]2)cc1
InChI Key: InChIKey=OLKGQFJZKSFYKF-UHFFFAOYSA-N
Data: 3 IC50
Activity Spreadsheet -- Enzyme Inhibition Constant Data from BindingDB
Found 3 hits for monomerid = 54731
Trg + Lig
Ki
nM
ΔG°
kcal/mole
IC50
nM
Kd
nM
EC50/IC50
nM
koff
s-1
kon
M-1s-1
pHTemp
°C
neuronal munc18-1 binding protein
(Rattus norvegicus)
BDBM54731
(MLS000580536 | N-[3-(1H-benzimidazol-2-yl)phenyl]-...)
Show SMILES Clc1ccc(SCC(=O)Nc2cccc(c2)-c2nc3ccccc3[nH]2)cc1
Show InChI InChI=1S/C21H16ClN3OS/c22-15-8-10-17(11-9-15)27-13-20(26)23-16-5-3-4-14(12-16)21-24-18-6-1-2-7-19(18)25-21/h1-12H,13H2,(H,23,26)(H,24,25)
PCBioAssay
n/an/a 3.67E+4n/an/an/an/an/an/a
Burnham Center for Chemical Genomics
Curated by PubChem BioAssay
Assay Description
Data Source: Sanford-Burnham Center for Chemical Genomics (SBCCG) Source Affiliation: Sanford-Burnham Medical Research Institute (SBMRI, San Diego, C...
PubChem Bioassay (2009)
BindingDB Entry DOI: 10.7270/Q20P0XFH
neuronal munc18-1 binding protein
(Rattus norvegicus)
BDBM54731
(MLS000580536 | N-[3-(1H-benzimidazol-2-yl)phenyl]-...)
Show SMILES Clc1ccc(SCC(=O)Nc2cccc(c2)-c2nc3ccccc3[nH]2)cc1
Show InChI InChI=1S/C21H16ClN3OS/c22-15-8-10-17(11-9-15)27-13-20(26)23-16-5-3-4-14(12-16)21-24-18-6-1-2-7-19(18)25-21/h1-12H,13H2,(H,23,26)(H,24,25)
PCBioAssay
n/an/a 2.69E+4n/an/an/an/an/an/a
Burnham Center for Chemical Genomics
Curated by PubChem BioAssay
Assay Description
Data Source: Sanford-Burnham Center for Chemical Genomics (SBCCG) Source Affiliation: Sanford-Burnham Medical Research Institute (SBMRI, San Diego, C...
PubChem Bioassay (2010)
BindingDB Entry DOI: 10.7270/Q21V5CDC
Voltage-gated calcium channel subunit alpha Cav2.2
(Homo sapiens (Human))
BDBM54731
(MLS000580536 | N-[3-(1H-benzimidazol-2-yl)phenyl]-...)
Show SMILES Clc1ccc(SCC(=O)Nc2cccc(c2)-c2nc3ccccc3[nH]2)cc1
Show InChI InChI=1S/C21H16ClN3OS/c22-15-8-10-17(11-9-15)27-13-20(26)23-16-5-3-4-14(12-16)21-24-18-6-1-2-7-19(18)25-21/h1-12H,13H2,(H,23,26)(H,24,25)
PCBioAssay
n/an/a 2.75E+3n/an/an/an/an/an/a
Burnham Center for Chemical Genomics
Curated by PubChem BioAssay
Assay Description
Data Source: Data Source: Sanford-Burnham Center for Chemical Genomics (SBCCG) Source Affiliation: Sanford-Burnham Medical Research Institute Network...
PubChem Bioassay (2009)
BindingDB Entry DOI: 10.7270/Q2PZ578V