BDBM54735 (5E)-3-ethyl-5-[(5-methyl-2-furanyl)methylidene]imidazolidine-2,4-dione::(5E)-3-ethyl-5-[(5-methyl-2-furyl)methylene]hydantoin::(5E)-3-ethyl-5-[(5-methylfuran-2-yl)methylidene]imidazolidine-2,4-dione::3-ethyl-5-[(5-methyl-2-furyl)methylene]-2,4-imidazolidinedione::MLS000702381::SMR000226550::cid_1795960
SMILES: CCN1C(=O)N\C(=C\c2ccc(C)o2)C1=O
InChI Key: InChIKey=FPGTVBYXMAWINI-RMKNXTFCSA-N
Data: 2 IC50
Activity Spreadsheet -- Enzyme Inhibition Constant Data from BindingDB
Found 2 hits for monomerid = 54735
Trg + Lig
Ki
nM
ΔG°
kcal/mole
IC50
nM
Kd
nM
EC50/IC50
nM
koff
s-1
kon
M-1s-1
pHTemp
°C
Voltage-gated calcium channel subunit alpha Cav2.2
(Homo sapiens (Human))
BDBM54735
((5E)-3-ethyl-5-[(5-methyl-2-furanyl)methylidene]im...)
Show SMILES CCN1C(=O)N\C(=C\c2ccc(C)o2)C1=O
Show InChI InChI=1S/C11H12N2O3/c1-3-13-10(14)9(12-11(13)15)6-8-5-4-7(2)16-8/h4-6H,3H2,1-2H3,(H,12,15)/b9-6+
PCBioAssay
n/an/a 3.29E+3n/an/an/an/an/an/a
Burnham Center for Chemical Genomics
Curated by PubChem BioAssay
Assay Description
Data Source: Data Source: Sanford-Burnham Center for Chemical Genomics (SBCCG) Source Affiliation: Sanford-Burnham Medical Research Institute Network...
PubChem Bioassay (2009)
BindingDB Entry DOI: 10.7270/Q2PZ578V
neuronal munc18-1 binding protein
(Rattus norvegicus)
BDBM54735
((5E)-3-ethyl-5-[(5-methyl-2-furanyl)methylidene]im...)
Show SMILES CCN1C(=O)N\C(=C\c2ccc(C)o2)C1=O
Show InChI InChI=1S/C11H12N2O3/c1-3-13-10(14)9(12-11(13)15)6-8-5-4-7(2)16-8/h4-6H,3H2,1-2H3,(H,12,15)/b9-6+
PCBioAssay
n/an/a 2.26E+4n/an/an/an/an/an/a
Burnham Center for Chemical Genomics
Curated by PubChem BioAssay
Assay Description
Data Source: Sanford-Burnham Center for Chemical Genomics (SBCCG) Source Affiliation: Sanford-Burnham Medical Research Institute (SBMRI, San Diego, C...
PubChem Bioassay (2009)
BindingDB Entry DOI: 10.7270/Q20P0XFH