BDBM5478 6-(3-methyl-2-methylidenebutoxy)-9H-purin-2-amine::CHEMBL407877::O6-Substituted Guanine Deriv. 18
SMILES: CC(C)C(=C)COc1nc(N)nc2nc[nH]c12
InChI Key: InChIKey=GVEXNMKDLGGAPR-UHFFFAOYSA-N
Data: 4 IC50
Activity Spreadsheet -- Enzyme Inhibition Constant Data from BindingDB
Found 4 hits for monomerid = 5478
Trg + Lig
Ki
nM
ΔG°
kcal/mole
IC50
nM
Kd
nM
EC50/IC50
nM
koff
s-1
kon
M-1s-1
pHTemp
°C
Cyclin-Dependent Kinase 1 (CDK1)
(Marthasterias glacialis (starfish))
BDBM5478
(6-(3-methyl-2-methylidenebutoxy)-9H-purin-2-amine ...)
Show SMILES CC(C)C(=C)COc1nc(N)nc2nc[nH]c12
Show InChI InChI=1S/C11H15N5O/c1-6(2)7(3)4-17-10-8-9(14-5-13-8)15-11(12)16-10/h5-6H,3-4H2,1-2H3,(H3,12,13,14,15,16)
n/an/a 1.10E+4n/an/an/an/an/an/a
University of Newcastle
Assay Description
The enzyme was assayed with substrate histone H1 in the presence of 12.5 uM ATP/[gamma-32P] ATP. IC50 is the inhibitor concentration, which inhibits ...
J Med Chem 45: 3381-93 (2002)
Article DOI: 10.1021/jm020056z
BindingDB Entry DOI: 10.7270/Q2891424
Cyclin-Dependent Kinase 1 (CDK1)
(Homo sapiens (Human))
BDBM5478
(6-(3-methyl-2-methylidenebutoxy)-9H-purin-2-amine ...)
Show SMILES CC(C)C(=C)COc1nc(N)nc2nc[nH]c12
Show InChI InChI=1S/C11H15N5O/c1-6(2)7(3)4-17-10-8-9(14-5-13-8)15-11(12)16-10/h5-6H,3-4H2,1-2H3,(H3,12,13,14,15,16)
Reactome pathway
n/an/a 1.10E+4n/an/an/an/an/an/a
University of Zurich
Curated by ChEMBL
Assay Description
Inhibition of CDK1/Cyclin B
J Med Chem 51: 1179-88 (2008)
Article DOI: 10.1021/jm070654j
BindingDB Entry DOI: 10.7270/Q29Z95RD
6-O-methylguanine-DNA methyltransferase
(Homo sapiens (Human))
BDBM5478
(6-(3-methyl-2-methylidenebutoxy)-9H-purin-2-amine ...)
Show SMILES CC(C)C(=C)COc1nc(N)nc2nc[nH]c12
Show InChI InChI=1S/C11H15N5O/c1-6(2)7(3)4-17-10-8-9(14-5-13-8)15-11(12)16-10/h5-6H,3-4H2,1-2H3,(H3,12,13,14,15,16)
Reactome pathway
n/an/a>1.00E+6n/an/an/an/an/an/a
The University
Curated by ChEMBL
Assay Description
concentration required to reduce AGT activity to 50% of control rate in HT-29 cell extract.
J Med Chem 43: 4071-83 (2000)
BindingDB Entry DOI: 10.7270/Q2RF5T8B
Cyclin-Dependent Kinase 2 (CDK2)
(Homo sapiens (Human))
BDBM5478
(6-(3-methyl-2-methylidenebutoxy)-9H-purin-2-amine ...)
Show SMILES CC(C)C(=C)COc1nc(N)nc2nc[nH]c12
Show InChI InChI=1S/C11H15N5O/c1-6(2)7(3)4-17-10-8-9(14-5-13-8)15-11(12)16-10/h5-6H,3-4H2,1-2H3,(H3,12,13,14,15,16)
NCI pathway
Reactome pathway
n/an/a 1.60E+4n/an/an/an/an/an/a
University of Newcastle
Assay Description
The enzyme was assayed with substrate histone H1 in the presence of 12.5 uM ATP/[gamma-32P] ATP. IC50 is the inhibitor concentration, which inhibits ...
J Med Chem 45: 3381-93 (2002)
Article DOI: 10.1021/jm020056z
BindingDB Entry DOI: 10.7270/Q2891424
3D
3D Structure (docked)